profile-image

seqizz

Gürkan Gür Adana, Turkey
KWin Button applet improved KDE Plasma 4 Extensions
Aug 04 2011
Scale Up Various KDE Extensions
doesn't compile in kde 4.7:


[ 80%] [100%] Building CXX object CMakeFiles/kcm_kwin4_effect_scaleup.dir/kcm_kwin4_effect_scaleup_automoc.o
Building CXX object CMakeFiles/kcm_kwin4_effect_scaleup.dir/scaleup_config.o
In file included from /tmp/yaourt-tmp-root/aur-kwin-effect-scaleout-git/src/kwin-effect-scaleout/scaleup.cpp:18:0:
/tmp/yaourt-tmp-root/aur-kwin-effect-scaleout-git/src/kwin-effect-scaleout/scaleup.h:41:37: error: ‘TimeLine’ was not declared in this scope
/tmp/yaourt-tmp-root/aur-kwin-effect-scaleout-git/src/kwin-effect-scaleout/scaleup.h:41:46: error: template argument 2 is invalid
/tmp/yaourt-tmp-root/aur-kwin-effect-scaleout-git/src/kwin-effect-scaleout/scaleup.cpp: In member function ‘virtual void KWin::ScaleUpEffect::reconfigure(KWin::Effect::ReconfigureFlags)’:
/tmp/yaourt-tmp-root/aur-kwin-effect-scaleout-git/src/kwin-effect-scaleout/scaleup.cpp:32:18: error: variable ‘KConfigGroup conf’ has initializer but incomplete type
/tmp/yaourt-tmp-root/aur-kwin-effect-scaleout-git/src/kwin-effect-scaleout/scaleup.cpp:32:63: error: invalid use of incomplete type ‘struct KConfigGroup’
/usr/include/kconfigbase.h:32:7: error: forward declaration of ‘struct KConfigGroup’
/tmp/yaourt-tmp-root/aur-kwin-effect-scaleout-git/src/kwin-effect-scaleout/scaleup.cpp: In member function ‘virtual void KWin::ScaleUpEffect::prePaintScreen(KWin::ScreenPrePaintData&, int)’:
/tmp/yaourt-tmp-root/aur-kwin-effect-scaleout-git/src/kwin-effect-scaleout/scaleup.cpp:41:27: error: request for member ‘isEmpty’ in ‘((KWin::ScaleUpEffect*)this)->KWin::ScaleUpEffect::mTimeLineWindows’, which is of non-class type ‘int’
/tmp/yaourt-tmp-root/aur-kwin-effect-scaleout-git/src/kwin-effect-scaleout/scaleup.cpp: In member function ‘virtual void KWin::ScaleUpEffect::prePaintWindow(KWin::EffectWindow*, KWin::WindowPrePaintData&, int)’:
/tmp/yaourt-tmp-root/aur-kwin-effect-scaleout-git/src/kwin-effect-scaleout/scaleup.cpp:48:26: error: request for member ‘contains’ in ‘((KWin::ScaleUpEffect*)this)->KWin::ScaleUpEffect::mTimeLineWindows’, which is of non-class type ‘int’
/tmp/yaourt-tmp-root/aur-kwin-effect-scaleout-git/src/kwin-effect-scaleout/scaleup.cpp:50:31: error: ‘class KWin::EffectWindow’ has no member named ‘addTime’
/tmp/yaourt-tmp-root/aur-kwin-effect-scaleout-git/src/kwin-effect-scaleout/scaleup.cpp:51:35: error: ‘class KWin::EffectWindow’ has no member named ‘value’
/tmp/yaourt-tmp-root/aur-kwin-effect-scaleout-git/src/kwin-effect-scaleout/scaleup.cpp:54:30: error: request for member ‘remove’ in ‘((KWin::ScaleUpEffect*)this)->KWin::ScaleUpEffect::mTimeLineWindows’, which is of non-class type ‘int’
/tmp/yaourt-tmp-root/aur-kwin-effect-scaleout-git/src/kwin-effect-scaleout/scaleup.cpp: In member function ‘virtual void KWin::ScaleUpEffect::paintWindow(KWin::EffectWindow*, int, QRegion, KWin::WindowPaintData&)’:
/tmp/yaourt-tmp-root/aur-kwin-effect-scaleout-git/src/kwin-effect-scaleout/scaleup.cpp:61:26: error: request for member ‘contains’ in ‘((KWin::ScaleUpEffect*)this)->KWin::ScaleUpEffect::mTimeLineWindows’, which is of non-class type ‘int’
/tmp/yaourt-tmp-root/aur-kwin-effect-scaleout-git/src/kwin-effect-scaleout/scaleup.cpp:66:50: error: ‘class KWin::EffectWindow’ has no member named ‘value’
/tmp/yaourt-tmp-root/aur-kwin-effect-scaleout-git/src/kwin-effect-scaleout/scaleup.cpp: In member function ‘virtual void KWin::ScaleUpEffect::postPaintWindow(KWin::EffectWindow*)’:
/tmp/yaourt-tmp-root/aur-kwin-effect-scaleout-git/src/kwin-effect-scaleout/scaleup.cpp:81:26: error: request for member ‘contains’ in ‘((KWin::ScaleUpEffect*)this)->KWin::ScaleUpEffect::mTimeLineWindows’, which is of non-class type ‘int’
/tmp/yaourt-tmp-root/aur-kwin-effect-scaleout-git/src/kwin-effect-scaleout/scaleup.cpp: In member function ‘virtual void KWin::ScaleUpEffect::windowUserMovedResized(KWin::EffectWindow*, bool, bool)’:
/tmp/yaourt-tmp-root/aur-kwin-effect-scaleout-git/src/kwin-effect-scaleout/scaleup.cpp:103:9: error: ‘TimeLine’ was not declared in this scope
/tmp/yaourt-tmp-root/aur-kwin-effect-scaleout-git/src/kwin-effect-scaleout/scaleup.cpp:103:19: error: ‘t’ was not declared in this scope
/tmp/yaourt-tmp-root/aur-kwin-effect-scaleout-git/src/kwin-effect-scaleout/scaleup.cpp:104:26: error: ‘TimeLine’ is not a class or namespace
/tmp/yaourt-tmp-root/aur-kwin-effect-scaleout-git/src/kwin-effect-scaleout/scaleup.cpp: In member function ‘virtual void KWin::ScaleUpEffect::windowClosed(KWin::EffectWindow*)’:
/tmp/yaourt-tmp-root/aur-kwin-effect-scaleout-git/src/kwin-effect-scaleout/scaleup.cpp:118:22: error: request for member ‘remove’ in ‘((KWin::ScaleUpEffect*)this)->KWin::ScaleUpEffect::mTimeLineWindows’, which is of non-class type ‘int’
make[2]: *** [CMakeFiles/kwin4_effect_scaleup.dir/scaleup.o] Error 1
make[1]: *** [CMakeFiles/kwin4_effect_scaleup.dir/all] Error 2
make[1]: *** Waiting for unfinished jobs....
Aug 03 2011
Gentoo Logo Green KDM4 KDM4 Themes
Mar 15 2011
Slim Glow Plasma Themes
Mar 05 2011
Quick Usb Formatter System Software
Feb 11 2011
Automated Font Installer Nautilus Scripts
Jun 29 2008