profile-image

sombragris

Eduardo Sanchez Asunción, Paraguay
Weather Widget Plasma Widgets
Jul 07 2017
qomp Audioplayers
Jul 04 2017
qomp Audioplayers
Jul 04 2017
qomp Audioplayers
Jul 03 2017
PulseEffects Audio
Jul 02 2017
PulseEffects Audio
pulseeffects fails to run. This is the console output:

19:26:39.561 - PulseEffects - INFO - pulseaudio context started
19:26:39.562 - PulseEffects - INFO - connected to server: unix:/tmp/xdg-runtime-eduardo/pulse/native
19:26:39.562 - PulseEffects - INFO - server protocol version: 32
19:26:39.562 - PulseEffects - INFO - pulseaudio version: 10.0-rebootstrapped
19:26:39.562 - PulseEffects - INFO - default pulseaudio source: alsa_input.pci-0000_00_1b.0.analog-stereo
19:26:39.562 - PulseEffects - INFO - default pulseaudio sink: alsa_output.pci-0000_00_1b.0.analog-stereo
19:26:39.562 - PulseEffects - INFO - default pulseaudio sink audio format: s16le
19:26:39.562 - PulseEffects - INFO - default pulseaudio sink sampling rate: 44100 Hz. We will use the same rate.
19:26:39.563 - PulseEffects - INFO - default pulseaudio source audio format: s16le
19:26:39.563 - PulseEffects - INFO - default pulseaudio source sampling rate: 44100 Hz. We will use the same rate.
19:26:39.563 - PulseEffects - INFO - loading Pulseeffects applications sink...
19:26:39.563 - PulseEffects - INFO - Pulseeffects apps sink was successfully loaded
19:26:39.563 - PulseEffects - INFO - Pulseeffects apps sink index:1
19:26:39.563 - PulseEffects - INFO - Pulseeffects apps sink monitor name: PulseEffects_apps.monitor
19:26:39.563 - PulseEffects - INFO - loading Pulseeffects microphone output sink...
19:26:39.564 - PulseEffects - INFO - Pulseeffects mic sink was successfully loaded
19:26:39.564 - PulseEffects - INFO - Pulseeffects mic sink index:2
19:26:39.564 - PulseEffects - INFO - Pulseeffects mic sink monitor name: PulseEffects_mic.monitor
Traceback (most recent call last):
File "/usr/bin/pulseeffects", line 4, in
__import__('pkg_resources').run_script('PulseEffects==2.0.2', 'pulseeffects')
File "/usr/lib64/python3.6/site-packages/pkg_resources/__init__.py", line 743, in run_script
self.require(requires)[0].run_script(script_name, ns)
File "/usr/lib64/python3.6/site-packages/pkg_resources/__init__.py", line 1498, in run_script
exec(code, namespace, namespace)
File "/usr/lib64/python3.6/site-packages/PulseEffects-2.0.2-py3.6.egg/EGG-INFO/scripts/pulseeffects", line 6, in
a = Application()
File "/usr/lib64/python3.6/site-packages/PulseEffects-2.0.2-py3.6.egg/PulseEffects/application.py", line 62, in __init__
self.sie = SinkInputEffects(self.pm.default_sink_rate)
File "/usr/lib64/python3.6/site-packages/PulseEffects-2.0.2-py3.6.egg/PulseEffects/sink_input_effects.py", line 65, in __init__
self.pipeline = self.build_pipeline()
File "/usr/lib64/python3.6/site-packages/PulseEffects-2.0.2-py3.6.egg/PulseEffects/sink_input_effects.py", line 176, in build_pipeline
self.output_limiter.set_property('input-gain', 0)
AttributeError: 'NoneType' object has no attribute 'set_property'
Jul 02 2017
qomp Audioplayers
Thanks for developing qomp. I cannot build 1.2.1

Using gcc-7.1 and Qt 5.9

Here is the compiler output:


[ 55%] Built target filesystemplugin_autogen
Scanning dependencies of target filesystemplugin
[ 56%] Building CXX object plugins/filesystemplugin/CMakeFiles/filesystemplugin.dir/filesystemplugin.cpp.o
In file included from /usr/include/c++/7.1.0/chrono:41:0,
from /usr/include/qt5/QtCore/qobject.h:59,
from /usr/include/qt5/QtCore/QObject:1,
from /tmp/SBo/qomp-1.2.1/build/include/qompplugin.h:23,
from /tmp/SBo/qomp-1.2.1/plugins/filesystemplugin/filesystemplugin.h:23,
from /tmp/SBo/qomp-1.2.1/plugins/filesystemplugin/filesystemplugin.cpp:20:
/usr/include/c++/7.1.0/ctime:64:11: error: ‘::clock’ has not been declared
using ::clock;
^~~~~
/usr/include/c++/7.1.0/ctime:65:11: error: ‘::difftime’ has not been declared
using ::difftime;
^~~~~~~~
/usr/include/c++/7.1.0/ctime:66:11: error: ‘::mktime’ has not been declared
using ::mktime;
^~~~~~
/usr/include/c++/7.1.0/ctime:67:11: error: ‘::time’ has not been declared
using ::time;
^~~~
/usr/include/c++/7.1.0/ctime:68:11: error: ‘::asctime’ has not been declared
using ::asctime;
^~~~~~~
/usr/include/c++/7.1.0/ctime:69:11: error: ‘::ctime’ has not been declared
using ::ctime;
^~~~~
/usr/include/c++/7.1.0/ctime:70:11: error: ‘::gmtime’ has not been declared
using ::gmtime;
^~~~~~
/usr/include/c++/7.1.0/ctime:71:11: error: ‘::localtime’ has not been declared
using ::localtime;
^~~~~~~~~
/usr/include/c++/7.1.0/ctime:72:11: error: ‘::strftime’ has not been declared
using ::strftime;
^~~~~~~~
make[2]: *** [plugins/filesystemplugin/CMakeFiles/filesystemplugin.dir/build.make:63: plugins/filesystemplugin/CMakeFiles/filesystemplugin.dir/filesystemplugin.cpp.o] Error 1
make[1]: *** [CMakeFiles/Makefile2:359: plugins/filesystemplugin/CMakeFiles/filesystemplugin.dir/all] Error 2
make: *** [Makefile:130: all] Error 2
Jul 02 2017
Qalculate Plasma Widgets
May 23 2017
Qalculate Plasma Widgets
May 10 2017
Qalculate Plasma Widgets
May 09 2017
Qalculate Plasma Widgets
May 08 2017
ksnip Utilities
Jan 19 2017
ksnip Utilities
Jan 19 2017
ksnip Utilities
Oct 23 2016
Qalculate Plasma Widgets
Oct 01 2016