PaweĊ‚ Baranowski , Poland
Alexandra Video Library

Video 16 comments

Score 63%
37 Dislikes
Nov 20 2017
Hi, there are scripts for build this package for Arch Linux (and probably other arch-based distros):,413.msg2024.html - Aug 26 2015

Security 24 comments

Score 62%
38 Dislikes
Sep 12 2017
Here:,398.msg1970.html#msg1970 you have new PKGBUILD that builds both version of this package, against of Qt4 (for KDE4) and Qt5 (for Plasma 5/LXQT). Of course in the first post in this thread we have *.desktop and *.install files.

I have a few question to you, but... maybe later :) - Aug 05 2015
There is:,398.0.html all necessary scripts for build package for Arch Linux.
Version builds against of Qt5 works good, but I have to improve scripts for Qt4 version because of error in intallation (apps works). - Aug 05 2015
QupZilla Theme - Flat

Various KDE 1.-4. Styles 17 comments

Score 50%
50 Dislikes
Dec 23 2014
And another one tip: you have to delete PaxHeader folder within QZ-flat folder after unpack it. - Dec 23 2014
It's even not 7z pack but 7z (with little manual help) can unpack it :) - Dec 22 2014
OK. It's not *.zip file :) Everyone who want to unpack should do this:
- download file,
- in folder with downloaded file do: 7z x;
- now, you can see new file called QZ-flat
- delete (or just change the name of)
- rename QZ-flat to,
- unpack 7z x
All files of theme wil be stored in QZ-flat folder. - Dec 22 2014
Ark, unzip, 7z... zip-file is corrupted as it's shown on my previous post. - Dec 22 2014
Unfortunetly, zip-file from dropbox is still corrupted.

End-of-central-directory signature not found. Either this file is not
a zipfile, or it constitutes one disk of a multi-part archive. In the
latter case the central directory and zipfile comment will be found on
the last disk(s) of this archive.
unzip: cannot find zipfile directory in one of or, and cannot find, period.[/code]
It's a pity, because your works look great. - Dec 22 2014

Graphics 4 comments

Score 59%
41 Dislikes
Jul 15 2014
I've never noticed any problems with "sudo make install" on Arch with Qt applications (build with cmake or qmake). I could reproduce this error everytime I've building QScanner.
I'll try to build it on Sabayon or Gentoo. - Jul 25 2014
Hi. First of all - thanks for new scanning application for Qt/KDE, more functional then available in them.
I've tried to build QScanner as below:
qmake-qt4 (I'm Arch Linux user)
sudo make install.
The first two commands are finished properly, but the third with this error:
make: there is nothing to do in 'install'.
Application is build in make directory and works (but I have no possibility to save it as pdf.
What did I do wrong?
- Jul 23 2014

Graphics 48 comments

by sars
Score 73%
27 Dislikes
Oct 31 2016
It's something wrong with link to source, becouse the answer is:
The requested URL /stable/skanlite/0.9/src/skanlite-1.0.tar.bz2 was not found on this server.

There aren't Skanlite version 1 in Ubuntu or Debian repository, too. According to, the latest version is 0.8.2 (in Quantal) and 0.9 (in Raring), and according to the latest version is 0.8.2 (in testing and sid).
- Feb 27 2013

Security 32 comments

Score 61%
39 Dislikes
Mar 05 2012
OK, I've understood my mistake. Now, I compile with:
and everything is OK.
Many thanks. - Jul 11 2012
Hi Musikolo.
Thanks for the answer.
There isn't any "next command' after that. Command sudo make install just ending its work and return to path.
I try to compile in that way (without root permission):
mkdir build
cd build
cmake -DCMAKE_INSTALL_PREFIX=`kde4-config --prefix` ..
make install
- Jul 11 2012
OK. I'm user of Kubuntu 12.04 with some modifications, but I have all neccessary devel packages to build kvirustotal.
According to INSTALL file, commands: cmake, and make don't return any errors. Unfortunetly command make install dont' install kvirustotal. It returns only:
sudo make install
[ 0%] Built target kvirustotal_automoc
Generating moc_filedownloader.cpp
Generating moc_taskscheduler.cpp
Generating moc_taskschedulerjob.cpp
[ 0%] Built target kvt_core_automoc
Scanning dependencies of target kvt_core
[ 2%] Building CXX object core/CMakeFiles/kvt_core.dir/kvt_core_automoc.o
Linking CXX static library ../lib/libkvt_core.a
[ 18%] Built target kvt_core
[ 18%] Built target kvt_web_automoc
[ 18%] Built target kvt_base_automoc
[ 34%] Built target kvt_base
[ 51%] Built target kvt_web
[ 51%] Built target kvt_api_automoc
[ 63%] Built target kvt_api
Linking CXX executable kvirustotal
[100%] Built target kvirustotal
[100%] Built target translations
Install the project...
-- Install configuration: "Debug"
-- Installing: /home/pawel/tmp/kvirustotal-0.30.0/build/kde4-config --prefix/bin/kvirustotal
-- Set runtime path of "/home/pawel/tmp/kvirustotal-0.30.0/build/kde4-config --prefix/bin/kvirustotal" to "/home/pawel/tmp/kvirustotal-0.30.0/build/kde4-config --prefix/lib"
-- Installing: /home/pawel/tmp/kvirustotal-0.30.0/build/kde4-config --prefix/share/applications/kde4/kvirustotal.desktop
-- Installing: /home/pawel/tmp/kvirustotal-0.30.0/build/kde4-config --prefix/share/kde4/services/ServiceMenus/kvirustotal_servicemenu.desktop
-- Installing: /home/pawel/tmp/kvirustotal-0.30.0/build/kde4-config --prefix/share/apps/kvirustotal/pics/kvirustotal-connecting.gif
-- Installing: /home/pawel/tmp/kvirustotal-0.30.0/build/kde4-config --prefix/share/apps/kvirustotal/pics/padlock-green.png
-- Installing: /home/pawel/tmp/kvirustotal-0.30.0/build/kde4-config --prefix/share/apps/kvirustotal/pics/padlock-red.png
-- Installing: /home/pawel/tmp/kvirustotal-0.30.0/build/kde4-config --prefix/share/icons/hicolor/16x16/apps/./kvirustotal.png
-- Installing: /home/pawel/tmp/kvirustotal-0.30.0/build/kde4-config --prefix/share/icons/hicolor/32x32/apps/./kvirustotal.png
-- Installing: /home/pawel/tmp/kvirustotal-0.30.0/build/kde4-config --prefix/share/icons/hicolor/64x64/apps/./kvirustotal.png
-- Installing: /home/pawel/tmp/kvirustotal-0.30.0/build/kde4-config --prefix/share/icons/hicolor/48x48/apps/./kvirustotal.png
-- Installing: /home/pawel/tmp/kvirustotal-0.30.0/build/kde4-config --prefix/share/locale/ru/LC_MESSAGES/
-- Installing: /home/pawel/tmp/kvirustotal-0.30.0/build/kde4-config --prefix/share/locale/es/LC_MESSAGES/
-- Installing: /home/pawel/tmp/kvirustotal-0.30.0/build/kde4-config --prefix/share/locale/cs/LC_MESSAGES/
-- Installing: /home/pawel/tmp/kvirustotal-0.30.0/build/kde4-config --prefix/share/locale/hu/LC_MESSAGES/
-- Installing: /home/pawel/tmp/kvirustotal-0.30.0/build/kde4-config --prefix/share/locale/de/LC_MESSAGES/
-- Installing: /home/pawel/tmp/kvirustotal-0.30.0/build/kde4-config --prefix/share/locale/it/LC_MESSAGES/
After that commands: kvirustotal (even with root privilage) returns "command not found", and commands locate (or find) kvirustotal returns that kvirustotal is found only in my temporary directory.
I've tried to use checkinstall, too, but package is without any content. - Jul 08 2012
wvdial plasmoid

Plasma 4 Widgets 22 comments

Score 68%
32 Dislikes
Jul 11 2012
I've tried to compile this plasmoid, but "make" command returns error. I'm using Kubuntu 12.04 with KDE 4.8.90 (KDE4.9beta), Qt4.8. I installed kde4-workspace-dev package (here is filelist of it: )
The error with make is there:
Scanning dependencies of target plasma_applet_wvdial_automoc
Generating wvdial.moc
Generating moc_wvdialTextItem.cpp
[ 0%] Built target plasma_applet_wvdial_automoc
[ 25%] Generating ui_wvdialConfig.h
Scanning dependencies of target plasma_applet_wvdial
[ 50%] Building CXX object CMakeFiles/plasma_applet_wvdial.dir/plasma_applet_wvdial_automoc.o
[ 75%] Building CXX object CMakeFiles/plasma_applet_wvdial.dir/wvdial.o
/home/pawel/Pobrane/tmp/wvdial-plasmoid-1.3/wvdial.cpp:34:40: fatal error: solid/control/powermanager.h: No such file or directory compilation terminated.
make[2]: *** [CMakeFiles/plasma_applet_wvdial.dir/wvdial.o] Error 1
make[1]: *** [CMakeFiles/plasma_applet_wvdial.dir/all] Error 2
make: *** [all] Error 2
- Jul 11 2012