profile-image

mfg

Manuel Fernandez Mexico city, Mexico
LyX -- The Document Processor

Office 35 comments

Score 85%
85 Likes
15 Dislikes
Mar 17 2018
compiles ok in kubuntu hardy i386

works nicely with qt4.4 - May 12 2008
Kayali

Science 1 comment

by haq2
Score 72%
72 Likes
28 Dislikes
Jan 14 2007
Your program works nicely although it is somewhat restricted at this stage.

congratulations! - May 06 2007
cb2Bib

Science 40 comments

Score 81%
81 Likes
19 Dislikes
Dec 22 2014
Dear Constans,
I was puzzled with your reply but now I sort of understand, at least one part.

cb2bib version 0.7.2 remains installed in the path /usr/bin/cb2bib

However, cb2bib version 0.8.1 does install in the path /usr/local/bin/cb2bib

For this reason when I invoked it from the kde menu it gave me version 0.7.2 and I thought the newer version was not installed.

yours, - Apr 03 2007
Does not install.
I have version 0.7.2 working fine.
However, this 0.8.1 version does not install. (nor did 0.7.3).

The output is:
mfg@tepal:~/tepal-sys/downloads/tex/cb2bib-0.8.1$ sudo make install
Password:
cd src && make -f Makefile install
make[1]: Entering directory `/home/mfg/tepal-sys/downloads/tex/cb2bib-0.8.1/src'
install -m 644 -p /home/mfg/tepal-sys/downloads/tex/cb2bib-0.8.1/AUTHORS /usr/local/share/cb2bib/
install -m 644 -p /home/mfg/tepal-sys/downloads/tex/cb2bib-0.8.1/COPYRIGHT /usr/local/share/cb2bib/
install -m 644 -p /home/mfg/tepal-sys/downloads/tex/cb2bib-0.8.1/LICENSE /usr/local/share/cb2bib/
cp -f -r /home/mfg/tepal-sys/downloads/tex/cb2bib-0.8.1/data /usr/local/share/cb2bib/
cp -f -r /home/mfg/tepal-sys/downloads/tex/cb2bib-0.8.1/c2btools /usr/local/share/cb2bib/
cp -f -r /home/mfg/tepal-sys/downloads/tex/cb2bib-0.8.1/testPDFImport /usr/local/share/cb2bib/
install -m 644 -p /home/mfg/tepal-sys/downloads/tex/cb2bib-0.8.1/src/icons/cb2bib.png /usr/local/share/pixmaps/
install -m 644 -p /home/mfg/tepal-sys/downloads/tex/cb2bib-0.8.1/cb2bib.desktop /usr/local/share/applications/
install -m 644 -p /home/mfg/tepal-sys/downloads/tex/cb2bib-0.8.1/dl_cb2bib.desktop /usr/local/share/applications/
install -m 755 -p "../bin/cb2bib" "/usr/local/bin/cb2bib"
strip "/usr/local/bin/cb2bib"
install -m 755 -p /home/mfg/tepal-sys/downloads/tex/cb2bib-0.8.1/c2btools/dl_cb2bib /usr/local/bin/
strip /usr/local/bin/dl_cb2bib
strip: /usr/local/bin/dl_cb2bib: File format not recognized
make[1]: [install_script] Error 1 (ignored)
make[1]: Leaving directory `/home/mfg/tepal-sys/downloads/tex/cb2bib-0.8.1/src'
mfg@tepal:~/tepal-sys/downloads/tex/cb2bib-0.8.1$ - Apr 02 2007
K3b Monkey's Audio plugin

Utilities 11 comments

by trueg
Score 76%
76 Likes
24 Dislikes
Sep 21 2006
I installed these libraries an still did not compile but realized from text that libhal-dev was also missing.

With all three it compiles fine. - Dec 17 2006
./configure is ok

make fails

I reproduce the lines where problems seem to begin in:

In file included from k3bmonkeydecoder.cpp:16:
k3bmonkeydecoder.h:19:29: error: k3baudiodecoder.h: No such file or directory
k3bmonkeydecoder.cpp:23:30: error: k3bpluginfactory.h: No such file or directory
k3bmonkeydecoder.h:23: error: expected class-name before '{' token
k3bmonkeydecoder.h:24: error: ISO C++ forbids declaration of 'Q_OBJECT' with no type - Sep 28 2006
Konference

Video Apps 139 comments

by maldn
Score 72%
72 Likes
28 Dislikes
Apr 21 2005
Dear Malte,
Your effort is very important because from what I have found we lack an appropriate conferencing tool in kde.

I cannot compile with "make" in kubuntu dapper. I include the last few lines before it aborts:

if /bin/sh ../../libtool --silent --mode=compile --tag=CXX g++ -DHAVE_CONFIG_H -
I. -I. -I../.. -I../../src/dialogs -I../../src/dialogs/config -I../../src/dialog
s/wizard -I/usr/include/kde -I/usr/share/qt3/include -I. -DQT_THREAD_SUPPORT
-D_REENTRANT -Wnon-virtual-dtor -Wno-long-long -Wundef -ansi -D_XOPEN_SOURCE=50
0 -D_BSD_SOURCE -Wcast-align -Wconversion -Wchar-subscripts -Wall -W -Wpointer-a
rith -Wwrite-strings -O2 -Wformat-security -Wmissing-format-attribute -fno-excep
tions -fno-check-new -fno-common -MT h263.lo -MD -MP -MF ".deps/h263.Tpo" \
-c -o h263.lo `test -f 'h263.cpp' || echo './'`h263.cpp; \
then mv -f ".deps/h263.Tpo" ".deps/h263.Plo"; \
else rm -f ".deps/h263.Tpo"; exit 1; \
fi
/usr/include/linux/videodev2.h:489: error: '__u64' does not name a type
/usr/include/linux/videodev2.h:560: error: 'v4l2_std_id' does not name a type
/usr/include/linux/videodev2.h:578: error: 'v4l2_std_id' does not name a type
/usr/include/linux/videodev2.h:615: error: 'v4l2_std_id' does not name a type
h263.cpp: In member function 'bool H263Container::H263StartEncoder(int, int, int )':
h263.cpp:63: error: 'struct AVCodecContext' has no member named 'frame_rate'
h263.cpp:64: error: 'struct AVCodecContext' has no member named 'frame_rate_base '
make[4]: *** [h263.lo] Error 1
make[4]: Leaving directory `/home/mfg/tepal-sys/downloads/konference-0.1/src/cod ecs'
make[3]: *** [all-recursive] Error 1
make[3]: Leaving directory `/home/mfg/tepal-sys/downloads/konference-0.1/src/cod ecs'
make[2]: *** [all-recursive] Error 1
make[2]: Leaving directory `/home/mfg/tepal-sys/downloads/konference-0.1/src'
make[1]: *** [all-recursive] Error 1
make[1]: Leaving directory `/home/mfg/tepal-sys/downloads/konference-0.1'
make: *** [all] Error 2
$ - Sep 13 2006