Image 01
profile-image

canders

C Andersen
cb2Bib

Science 40 comments

Rating: 7.2
Dec 22 2014
That's it. Thanks for your help. I had mistyped the version # of qt in that file.

This looks like an invaluable tool. Now I just have to learn Reg. Exp. :)

Thanks for the work.

It would be sweet if it could minimize to the system tray in kde. - Jul 12 2004
Any thoughts?

cd src && make -f Makefile
make[1]: Entering directory `/home/caa/src/cb2bib-0.1.3/src'
qmake -o Makefile src.pro
make[1]: Leaving directory `/home/caa/src/cb2bib-0.1.3/src'
make[1]: Entering directory `/home/caa/src/cb2bib-0.1.3/src'
/usr/lib/qt3//bin/uic cb2bibconfbase.ui -o cb2bibconfbase.h
/usr/lib/qt3//bin/uic saveregexpbase.ui -o saveregexpbase.h
g++ -c -pipe -Wall -W -O2 -fomit-frame-pointer -pipe -march=i586 -mcpu=pentiumpro -D_REENTRANT -DQT_NO_DEBUG -DQT_THREAD_SUPPORT -DQT_SHARED -I/usr/lib/qt3/mkspecs/default -I. -I/usr/lib/qt3//include -o main.o main.cpp
In file included from main.cpp:8:
cb2bib.h:37: error: syntax error before `{' token
cb2bib.h:38: error: virtual outside class declaration
cb2bib.h:38: error: non-member function `const char* className()' cannot have `const' method qualifier
cb2bib.h:38: error: virtual outside class declaration
cb2bib.h:38: error: virtual outside class declaration
cb2bib.h:38: error: virtual outside class declaration
cb2bib.h:38: error: virtual outside class declaration
cb2bib.h: In function `QObject* qObject()':
cb2bib.h:38: error: invalid use of `this' in non-member function
cb2bib.h: At global scope:
cb2bib.h:38: error: syntax error before `private'
cb2bib.h:42: error: destructors must be member functions
cb2bib.h:46: error: syntax error before `public'
cb2bib.h:49: error: virtual outside class declaration
cb2bib.h:50: error: virtual outside class declaration
cb2bib.h:51: error: virtual outside class declaration
cb2bib.h:52: error: virtual outside class declaration
cb2bib.h:53: error: virtual outside class declaration
cb2bib.h:54: error: virtual outside class declaration
cb2bib.h:55: error: virtual outside class declaration
cb2bib.h:56: error: virtual outside class declaration
cb2bib.h:57: error: virtual outside class declaration
cb2bib.h:58: error: virtual outside class declaration
cb2bib.h:59: error: virtual outside class declaration
cb2bib.h:60: error: virtual outside class declaration
cb2bib.h:61: error: virtual outside class declaration
cb2bib.h:62: error: virtual outside class declaration
cb2bib.h:64: error: virtual outside class declaration
cb2bib.h:65: error: virtual outside class declaration
cb2bib.h:66: error: virtual outside class declaration
cb2bib.h:67: error: virtual outside class declaration
cb2bib.h:68: error: virtual outside class declaration
cb2bib.h:69: error: virtual outside class declaration
cb2bib.h:70: error: virtual outside class declaration
cb2bib.h:71: error: virtual outside class declaration
cb2bib.h:72: error: virtual outside class declaration
cb2bib.h:73: error: virtual outside class declaration
cb2bib.h:74: error: virtual outside class declaration
cb2bib.h:75: error: virtual outside class declaration
cb2bib.h:76: error: virtual outside class declaration
cb2bib.h:77: error: virtual outside class declaration
cb2bib.h:79: error: syntax error before `protected'
cb2bib.h:97: error: syntax error before `protected'
main.cpp: In function `int main(int, char**)':
main.cpp:18: error: `cb2Bib' undeclared (first use this function)
main.cpp:18: error: (Each undeclared identifier is reported only once for each function it appears in.)
main.cpp:18: error: syntax error before `;' token
main.cpp:19: error: `w' undeclared (first use this function)
/usr/lib/qt3/include/qstringlist.h: At top level:
cb2bib.h:38: warning: `bool qt_static_property(QObject*, int, int, QVariant*)' declared `static' but never defined
cb2bib.h:38: warning: `QMetaObject* staticMetaObject()' declared `static' but never defined
cb2bib.h:38: warning: `QString tr(const char*, const char*)' declared `static' but never defined
cb2bib.h:38: warning: `QString trUtf8(const char*, const char*)' declared `static' but never defined
make[1]: *** [main.o] Error 1
make[1]: Leaving directory `/home/caa/src/cb2bib-0.1.3/src'
make: *** [sub-src] Error 2 - Jul 11 2004
Am I reading this correctly? Does this need to be compiled with Qt 3.3? I have 3.2.3 installed. Thanks. If your tool does what I hope it does, it will be a god-send.



make
cd src && qmake src.pro -o Makefile
cd src && make -f Makefile
make[1]: Entering directory `/home/caa/src/cb2bib-0.1.3/src'
/usr/lib/qt3//bin/uic cb2bibbase.ui -o cb2bibbase.h
uic: File generated with too recent version of Qt Designer (3.3 vs. 3.2.3)
make[1]: *** [cb2bibbase.h] Error 1
make[1]: Leaving directory `/home/caa/src/cb2bib-0.1.3/src'
make: *** [sub-src] Error 2 - Jul 11 2004
KOffice (KWord)

Office Apps 20 comments

Rating: 7.0
Jun 10 2007
How exactly do we get the special library? Is it in the source file?

Thanks. Great Work. - Jul 10 2004