Image 01
profile-image

dorg

judge eskandari

Cactaceae-flower

Nature Aug 01 2014
Score 52%
52 Likes
48 Dislikes

wallestor

Wallpaper Other Aug 01 2014
Score 50%
50 Likes
50 Dislikes
Bespin

Be-Shell/Bespin 1662 comments

Score 77%
77 Likes
23 Dislikes
Apr 25 2013
forgive me.... this becuse of my internet connection....
why i cant remove my comment...? - Jul 02 2014
i'll use & compiled bespin along time....
but this is first time i can't compile&install....
i has get fresh code again....
in normall mode i cant get make ...
i had to get make with mix of ./configure ->build->ccmake ../ (twice....!( ;-) ))-> then makefile will appear...
previews time i have long make.log...but not this time very smaller...& finally installed
this time only stlye & decoration are installed. they'r work peroperly... xbar half installed(dont sho menu(seems look for .kde but i have .kde4 & also i haven't xbar directory ...)...).
&ofcurse a square will appear in mouse hover icon-decoration....
another one don't installed....
i'v attached you'r want output on kdepaste...(KDE/Bespin 2014.07.02(http://paste.kde.org/phojtqbtd))
and a bug i had report much time ago....:
decoration :tooltip button not appear in noteboot mode...
feature request...:
gtk3(gnome)-like scrollbar for kde... if be possible
sorry for bad english...
thank for your support - Jul 02 2014
i'll use & compiled bespin along time....
but this is first time i can't compile&install....
i has get fresh code again....
in normall mode i cant get make ...
i had to get make with mix of ./configure ->build->ccmake ../ (twice....!( ;-) ))-> then makefile will appear...
previews time i have long make.log...but not this time very smaller...& finally installed
this time only stlye & decoration are installed. they'r work peroperly... xbar half installed(dont sho menu(seems look for .kde but i have .kde4 & also i haven't xbar directory ...)...).
&ofcurse a square will appear in mouse hover icon-decoration....
another one don't installed....
i'v attached you'r want output on kdepaste...(KDE/Bespin 2014.07.02(http://paste.kde.org/phojtqbtd))
and a bug i had report much time ago....:
decoration :tooltip button not appear in noteboot mode...
feature request...:
gtk3(gnome)-like scrollbar for kde... if be possible
sorry for bad english...
thank for your support - Jul 02 2014
i'll use & compiled bespin along time....
but this is first time i can't compile&install....
i has get fresh code again....
in normall mode i cant get make ...
i had to get make with mix of ./configure ->build->ccmake ../ (twice....!( ;-) ))-> then makefile will appear...
previews time i have long make.log...but not this time very smaller...& finally installed
this time only stlye & decoration are installed. they'r work peroperly... xbar half installed(dont sho menu(seems look for .kde but i have .kde4 & also i haven't xbar directory ...)...).
&ofcurse a square will appear in mouse hover icon-decoration....
another one don't installed....
i'v attached you'r want output on kdepaste...(KDE/Bespin 2014.07.02(http://paste.kde.org/phojtqbtd))
and a bug i had report much time ago....:
decoration :tooltip button not appear in noteboot mode...
feature request...:
gtk3(gnome)-like scrollbar for kde... if be possible
sorry for bad english...
thank for your support - Jul 02 2014
i'll use & compiled bespin along time....
but this is first time i can't compile&install....
i has get fresh code again....
in normall mode i cant get make ...
i had to get make with mix of ./configure ->build->ccmake ../ (twice....!( ;-) ))-> then makefile will appear...
previews time i have long make.log...but not this time very smaller...& finally installed
this time only stlye & decoration are installed. they'r work peroperly... xbar half installed(dont sho menu(seems look for .kde but i have .kde4 & also i haven't xbar directory ...)...).
&ofcurse a square will appear in mouse hover icon-decoration....
another one don't installed....
i'v attached you'r want output on kdepaste...(KDE/Bespin 2014.07.02(http://paste.kde.org/phojtqbtd))
and a bug i had report much time ago....:
decoration :tooltip button not appear in noteboot mode...
feature request...:
gtk3(gnome)-like scrollbar for kde... if be possible
sorry for bad english...
thank for your support - Jul 02 2014
i'll use & compiled bespin along time....
but this is first time i can't compile&install....
i has get fresh code again....
in normall mode i cant get make ...
i had to get make with mix of ./configure ->build->ccmake ../ (twice....!( ;-) ))-> then makefile will appear...
previews time i have long make.log...but not this time very smaller...& finally installed
this time only stlye & decoration are installed. they'r work peroperly... xbar half installed(dont sho menu(seems look for .kde but i have .kde4 & also i haven't xbar directory ...)...).
&ofcurse a square will appear in mouse hover icon-decoration....
another one don't installed....
i'v attached you'r want output on kdepaste...(KDE/Bespin 2014.07.02(http://paste.kde.org/phojtqbtd))
and a bug i had report much time ago....:
decoration :tooltip button not appear in noteboot mode...
feature request...:
gtk3(gnome)-like scrollbar for kde... if be possible
sorry for bad english...
thank for your support - Jul 02 2014
i'll use & compiled bespin along time....
but this is first time i can't compile&install....
i has get fresh code again....
in normall mode i cant get make ...
i had to get make with mix of ./configure ->build->ccmake ../ (twice....!( ;-) ))-> then makefile will appear...
previews time i have long make.log...but not this time very smaller...& finally installed
this time only stlye & decoration are installed. they'r work peroperly... xbar half installed(dont sho menu(seems look for .kde but i have .kde4 & also i haven't xbar directory ...)...).
&ofcurse a square will appear in mouse hover icon-decoration....
another one don't installed....
i'v attached you'r want output on kdepaste...(KDE/Bespin 2014.07.02(http://paste.kde.org/phojtqbtd))
and a bug i had report much time ago....:
decoration :tooltip button not appear in noteboot mode...
feature request...:
gtk3(gnome)-like scrollbar for kde... if be possible
sorry for bad english...
thank for your support - Jul 01 2014
thanks.it will allow me to install but not complete_configure.
i can see configure will stop after 52%....
previous error is total err that cmake show me...
but ./configure show more....
i'm sorry for long-log....
-- The C compiler identification is GNU 4.9.0
-- The CXX compiler identification is GNU 4.9.0
-- Check for working C compiler: /usr/bin/cc
-- Check for working C compiler: /usr/bin/cc -- works
-- Detecting C compiler ABI info
-- Detecting C compiler ABI info - done
-- Check for working CXX compiler: /usr/bin/c++
-- Check for working CXX compiler: /usr/bin/c++ -- works
-- Detecting CXX compiler ABI info
-- Detecting CXX compiler ABI info - done
-- Looking for Q_WS_X11
-- Looking for Q_WS_X11 - found
-- Looking for Q_WS_WIN
-- Looking for Q_WS_WIN - not found
-- Looking for Q_WS_QWS
-- Looking for Q_WS_QWS - not found
-- Looking for Q_WS_MAC
-- Looking for Q_WS_MAC - not found
-- Found Qt-Version 4.8.6 (using /usr/bin/qmake-qt4)
-- Looking for XOpenDisplay in /usr/lib64/libX11.so;/usr/lib64/libXext.so;/usr/lib64/libXft.so;/usr/lib64/libXau.so;/usr/lib64/libXdmcp.so;/usr/lib64/libXpm.so
-- Looking for XOpenDisplay in /usr/lib64/libX11.so;/usr/lib64/libXext.so;/usr/lib64/libXft.so;/usr/lib64/libXau.so;/usr/lib64/libXdmcp.so;/usr/lib64/libXpm.so - found
-- Looking for gethostbyname
-- Looking for gethostbyname - found
-- Looking for connect
-- Looking for connect - found
-- Looking for remove
-- Looking for remove - found
-- Looking for shmat
-- Looking for shmat - found
-- Looking for IceConnectionNumber in ICE
-- Looking for IceConnectionNumber in ICE - found
-- Found X11: /usr/lib64/libX11.so
-- Looking for include file pthread.h
-- Looking for include file pthread.h - found
-- Looking for pthread_create
-- Looking for pthread_create - not found
-- Looking for pthread_create in pthreads
-- Looking for pthread_create in pthreads - not found
-- Looking for pthread_create in pthread
-- Looking for pthread_create in pthread - found
-- Found Threads: TRUE
-- Found OpenSSL: /usr/lib64/libssl.so;/usr/lib64/libcrypto.so (found version "1.0.1h")
-- Looking for _POSIX_TIMERS
-- Looking for _POSIX_TIMERS - found
-- Found Automoc4: /usr/bin/automoc4
-- Found Perl: /usr/bin/perl (found version "5.20.0")
-- Found Phonon: /usr/include/qt4 (Required is at least version "4.3.80")
-- Performing Test _OFFT_IS_64BIT
-- Performing Test _OFFT_IS_64BIT - Success
-- Performing Test HAVE_FPIE_SUPPORT
-- Performing Test HAVE_FPIE_SUPPORT - Success
-- Performing Test __KDE_HAVE_W_OVERLOADED_VIRTUAL
-- Performing Test __KDE_HAVE_W_OVERLOADED_VIRTUAL - Success
-- Performing Test __KDE_HAVE_GCC_VISIBILITY
-- Performing Test __KDE_HAVE_GCC_VISIBILITY - Success
-- Found KDE 4.12 include dir: /usr/include
-- Found KDE 4.12 library dir: /usr/lib
-- Found the KDE4 kconfig_compiler preprocessor: /usr/bin/kconfig_compiler
-- Found automoc4: /usr/bin/automoc4
-- WARNING: *** ARGB windows are experimental, performance might suffer ***
-- WARNING: *** Variable shadow pixmap sizes will cause glitches on KWin < 4.7.4 and OpenGL ***
-- Found X11: /usr/lib64/libX11.so
-- Found X11: /usr/lib64/libX11.so
-- Found Qt4: /usr/bin/qmake-qt4 (found suitable version "4.8.6", minimum required is "4.3.0")
-- INFO: XRender was found - kwin deco & FX via GPU available!
-- QtDbus available - Style will support XBar
CMake Warning (dev) at /usr/share/apps/cmake/modules/KDE4Macros.cmake:592 (get_target_property):
Policy CMP0026 is not set: Disallow use of the LOCATION target property.
Run "cmake --help-policy CMP0026" for policy details. Use the cmake_policy
command to set the policy and suppress this warning.

The LOCATION property should not be read from target "be.shadowed". Use
the target name directly with add_custom_command, or use the generator
expression $<TARGET_FILE>, as appropriate.

Call Stack (most recent call first):
/usr/share/apps/cmake/modules/KDE4Macros.cmake:1025 (kde4_handle_rpath_for_executable)
be.shadowed/CMakeLists.txt:14 (kde4_add_executable)
This warning is for project developers. Use -Wno-dev to suppress it.

-- KWin headers found
-- Configuring done
CMake Warning (dev) at /usr/lib64/automoc4/Automoc4Config.cmake:248 (add_dependencies):
Policy CMP0046 is not set: Error on non-existent dependency in
add_dependencies. Run "cmake --help-policy CMP0046" for policy details.
Use the cmake_policy command to set the policy and suppress this warning.

The dependency target "be.shadowed_automoc" of target "be.shadowed" does
not exist.
Call Stack (most recent call first):
/usr/share/apps/cmake/modules/KDE4Macros.cmake:1018 (_automoc4_kde4_post_target_handling)
be.shadowed/CMakeLists.txt:14 (kde4_add_executable)
This warning is for project developers. Use -Wno-dev to suppress it.

-- Generating done
-- Build files have been written to: /home/dorg/prog/cloudcity-code/build

Configuration succeeded...

--> Do you want to run a cmake GUI to adjust the configuration? [y/N]




========================= Configuration done ============================

Ok, now just "cd build", "make" and "sudo make install"...
.....after install i can only see xbar...that xbar is not work - Jun 30 2014
thanks.it will allow me to install but not complete_configure.
i can see configure will stop after 52%....
previous error is total err that cmake show me...
but ./configure show more....
i'm sorry for long-log....
-- The C compiler identification is GNU 4.9.0
-- The CXX compiler identification is GNU 4.9.0
-- Check for working C compiler: /usr/bin/cc
-- Check for working C compiler: /usr/bin/cc -- works
-- Detecting C compiler ABI info
-- Detecting C compiler ABI info - done
-- Check for working CXX compiler: /usr/bin/c++
-- Check for working CXX compiler: /usr/bin/c++ -- works
-- Detecting CXX compiler ABI info
-- Detecting CXX compiler ABI info - done
-- Looking for Q_WS_X11
-- Looking for Q_WS_X11 - found
-- Looking for Q_WS_WIN
-- Looking for Q_WS_WIN - not found
-- Looking for Q_WS_QWS
-- Looking for Q_WS_QWS - not found
-- Looking for Q_WS_MAC
-- Looking for Q_WS_MAC - not found
-- Found Qt-Version 4.8.6 (using /usr/bin/qmake-qt4)
-- Looking for XOpenDisplay in /usr/lib64/libX11.so;/usr/lib64/libXext.so;/usr/lib64/libXft.so;/usr/lib64/libXau.so;/usr/lib64/libXdmcp.so;/usr/lib64/libXpm.so
-- Looking for XOpenDisplay in /usr/lib64/libX11.so;/usr/lib64/libXext.so;/usr/lib64/libXft.so;/usr/lib64/libXau.so;/usr/lib64/libXdmcp.so;/usr/lib64/libXpm.so - found
-- Looking for gethostbyname
-- Looking for gethostbyname - found
-- Looking for connect
-- Looking for connect - found
-- Looking for remove
-- Looking for remove - found
-- Looking for shmat
-- Looking for shmat - found
-- Looking for IceConnectionNumber in ICE
-- Looking for IceConnectionNumber in ICE - found
-- Found X11: /usr/lib64/libX11.so
-- Looking for include file pthread.h
-- Looking for include file pthread.h - found
-- Looking for pthread_create
-- Looking for pthread_create - not found
-- Looking for pthread_create in pthreads
-- Looking for pthread_create in pthreads - not found
-- Looking for pthread_create in pthread
-- Looking for pthread_create in pthread - found
-- Found Threads: TRUE
-- Found OpenSSL: /usr/lib64/libssl.so;/usr/lib64/libcrypto.so (found version "1.0.1h")
-- Looking for _POSIX_TIMERS
-- Looking for _POSIX_TIMERS - found
-- Found Automoc4: /usr/bin/automoc4
-- Found Perl: /usr/bin/perl (found version "5.20.0")
-- Found Phonon: /usr/include/qt4 (Required is at least version "4.3.80")
-- Performing Test _OFFT_IS_64BIT
-- Performing Test _OFFT_IS_64BIT - Success
-- Performing Test HAVE_FPIE_SUPPORT
-- Performing Test HAVE_FPIE_SUPPORT - Success
-- Performing Test __KDE_HAVE_W_OVERLOADED_VIRTUAL
-- Performing Test __KDE_HAVE_W_OVERLOADED_VIRTUAL - Success
-- Performing Test __KDE_HAVE_GCC_VISIBILITY
-- Performing Test __KDE_HAVE_GCC_VISIBILITY - Success
-- Found KDE 4.12 include dir: /usr/include
-- Found KDE 4.12 library dir: /usr/lib
-- Found the KDE4 kconfig_compiler preprocessor: /usr/bin/kconfig_compiler
-- Found automoc4: /usr/bin/automoc4
-- WARNING: *** ARGB windows are experimental, performance might suffer ***
-- WARNING: *** Variable shadow pixmap sizes will cause glitches on KWin < 4.7.4 and OpenGL ***
-- Found X11: /usr/lib64/libX11.so
-- Found X11: /usr/lib64/libX11.so
-- Found Qt4: /usr/bin/qmake-qt4 (found suitable version "4.8.6", minimum required is "4.3.0")
-- INFO: XRender was found - kwin deco & FX via GPU available!
-- QtDbus available - Style will support XBar
CMake Warning (dev) at /usr/share/apps/cmake/modules/KDE4Macros.cmake:592 (get_target_property):
Policy CMP0026 is not set: Disallow use of the LOCATION target property.
Run "cmake --help-policy CMP0026" for policy details. Use the cmake_policy
command to set the policy and suppress this warning.

The LOCATION property should not be read from target "be.shadowed". Use
the target name directly with add_custom_command, or use the generator
expression $<TARGET_FILE>, as appropriate.

Call Stack (most recent call first):
/usr/share/apps/cmake/modules/KDE4Macros.cmake:1025 (kde4_handle_rpath_for_executable)
be.shadowed/CMakeLists.txt:14 (kde4_add_executable)
This warning is for project developers. Use -Wno-dev to suppress it.

-- KWin headers found
-- Configuring done
CMake Warning (dev) at /usr/lib64/automoc4/Automoc4Config.cmake:248 (add_dependencies):
Policy CMP0046 is not set: Error on non-existent dependency in
add_dependencies. Run "cmake --help-policy CMP0046" for policy details.
Use the cmake_policy command to set the policy and suppress this warning.

The dependency target "be.shadowed_automoc" of target "be.shadowed" does
not exist.
Call Stack (most recent call first):
/usr/share/apps/cmake/modules/KDE4Macros.cmake:1018 (_automoc4_kde4_post_target_handling)
be.shadowed/CMakeLists.txt:14 (kde4_add_executable)
This warning is for project developers. Use -Wno-dev to suppress it.

-- Generating done
-- Build files have been written to: /home/dorg/prog/cloudcity-code/build

Configuration succeeded...

--> Do you want to run a cmake GUI to adjust the configuration? [y/N]




========================= Configuration done ============================

Ok, now just "cd build", "make" and "sudo make install"...
.....after install i can only see xbar...that xbar is not work - Jun 30 2014
thank's for replay...
but how to ignore it...
cmake not allow me to configure.... - Jun 29 2014
CMake Warning (dev) at /usr/share/apps/cmake/modules/KDE4Macros.cmake:592 (get_target_property):
Policy CMP0026 is not set: Disallow use of the LOCATION target property.
Run "cmake --help-policy CMP0026" for policy details. Use the cmake_policy
command to set the policy and suppress this warning.

The LOCATION property should not be read from target "be.shadowed". Use
the target name directly with add_custom_command, or use the generator
expression $<TARGET_FILE>, as appropriate.

Call Stack (most recent call first):
/usr/share/apps/cmake/modules/KDE4Macros.cmake:1025 (kde4_handle_rpath_for_executable)
be.shadowed/CMakeLists.txt:14 (kde4_add_executable)
This warning is for project developers. Use -Wno-dev to suppress it.
now what i must to do...? - Jun 28 2014
Apper

System Software 224 comments

Score 84%
84 Likes
16 Dislikes
Jan 08 2013
why detail in install & update not shown
size of package & downloaded
count of pacage & done
& a log of install / download
thank's - Oct 23 2013
Klear

Video Apps 44 comments

by kraus
Score 80%
80 Likes
20 Dislikes
Jul 22 2007
everything deprecated
""scons: warning: The Options class is deprecated; use the Variables class instead.
File "/home/x/programs/klear-0.6.1/bksys/generic.py", line 383, in generate

scons: warning: BuildDir() and the build_dir keyword have been deprecated;
use VariantDir() and the variant_dir keyword instead.
File "/home/x/programs/klear-0.6.1/bksys/generic.py", line 612, in set_build_dir

scons: warning: BuildDir() and the build_dir keyword have been deprecated;
use VariantDir() and the variant_dir keyword instead.
File "/home/x/programs/klear-0.6.1/bksys/generic.py", line 612, in set_build_dir
WARNING: moc.cpp for CKlearControllerSchedulerOverview.h consider using #include <file.moc> instead
WARNING: moc.cpp for CKlearControllerEPGMain.h consider using #include <file.moc> instead
WARNING: moc.cpp for CKlearControllerTXTMain.h consider using #include <file.moc> instead
WARNING: moc.cpp for CKlearControllerMain.h consider using #include <file.moc> instead
WARNING: moc.cpp for CKlearControllerScheduler.h consider using #include <file.moc> instead
WARNING: moc.cpp for CKlearControllerConfig.h consider using #include <file.moc> instead
WARNING: moc.cpp for CKlearControllerScanView.h consider using #include <file.moc> instead
WARNING: moc.cpp for CKlearAppScheduler.h consider using #include <file.moc> instead
WARNING: moc.cpp for CKlearAppTXTDecoder.h consider using #include <file.moc> instead
WARNING: moc.cpp for CKlearEngineXine.h consider using #include <file.moc> instead
WARNING: moc.cpp for CKlearEngineMPlayer.h consider using #include <file.moc> instead

scons: warning: The env.Copy() method is deprecated; use the env.Clone() method instead.
File "/home/x/programs/klear-0.6.1/bksys/generic.py", line 202, in execute
scons: done reading SConscript files.
scons: Building targets ...
g++ -o build/src/GUI/Controller/CKlearControllerSchedulerOverview.o -c -I/usr/include/kde/ -I/usr/lib64/qt-3.3/include/ -Wall -O2 -D_REENTRANT -DQT_NO_DEBUG -DQT_THREAD_SUPPORT -DQT_SHARED -DQT_TABLET_SUPPORT -O2 -DNDEBUG -DNO_DEBUG -DQT_NO_TRANSLATION -I. -I. -Ibuild/src/App -Ibuild/src/App/EPG -Ibuild/src/App/TXT -Ibuild/src/App/Tuner -Ibuild/src/App/Exceptions -Ibuild/src/App/Engines -Ibuild/src/App/Engines/KlearMPlayer -Ibuild/src/App/Engines/KlearXine -Ibuild/src/App/Engines/KlearXineTNG -Ibuild/src/GUI/View -Ibuild/src/GUI/Controller -Ibuild/src/Utilities build/src/GUI/Controller/CKlearControllerSchedulerOverview.cpp
In file included from build/src/GUI/Controller/./../../App/./CKlearAppConfig.h:21:0,
from build/src/GUI/Controller/./../../App/CKlearAppRecorder.h:27,
from build/src/GUI/Controller/./../../App/CKlearAppScheduler.h:25,
from build/src/GUI/Controller/./CKlearControllerSchedulerOverview.h:18,
from build/src/GUI/Controller/CKlearControllerSchedulerOverview.cpp:8:
build/src/GUI/Controller/CKlearControllerSchedulerOverview.cpp: In member function ‘virtual void CKlearControllerSchedulerOverview::slotSaveRecordSet()’:
build/src/GUI/Controller/./../../App/././Exceptions/CKlearAppException.h:23:117: error: cannot call constructor ‘QString::QString’ directly [-fpermissive]
#define __LOC__ "At line "+QString::QString(QString::number(__LINE__)+" in file "+__FILE__+" and function "+__FUNC__)
^
build/src/GUI/Controller/CKlearControllerSchedulerOverview.cpp:58:29: note: in expansion of macro ‘__LOC__’
e.addShowException( __LOC__, i18n("Could not save recordsets to disk \n") );
^
build/src/GUI/Controller/./../../App/././Exceptions/CKlearAppException.h:23:117: error: for a function-style cast, remove the redundant ‘::QString’ [-fpermissive]
#define __LOC__ "At line "+QString::QString(QString::number(__LINE__)+" in file "+__FILE__+" and function "+__FUNC__)
^
build/src/GUI/Controller/CKlearControllerSchedulerOverview.cpp:58:29: note: in expansion of macro ‘__LOC__’
e.addShowException( __LOC__, i18n("Could not save recordsets to disk \n") );
^
build/src/GUI/Controller/CKlearControllerSchedulerOverview.cpp: In member function ‘virtual void CKlearControllerSchedulerOverview::slotAddRecordSet()’:
build/src/GUI/Controller/./../../App/././Exceptions/CKlearAppException.h:23:117: error: cannot call constructor ‘QString::QString’ directly [-fpermissive]
#define __LOC__ "At line "+QString::QString(QString::number(__LINE__)+" in file "+__FILE__+" and function "+__FUNC__)
^
build/src/GUI/Controller/CKlearControllerSchedulerOverview.cpp:75:31: note: in expansion of macro ‘__LOC__’
e.addShowException( __LOC__, i18n("Could not create ControllerScheduler dialog." ));
^
build/src/GUI/Controller/./../../App/././Exceptions/CKlearAppException.h:23:117: error: for a function-style cast, remove the redundant ‘::QString’ [-fpermissive]
#define __LOC__ "At line "+QString::QString(QString::number(__LINE__)+" in file "+__FILE__+" and function "+__FUNC__)
^
build/src/GUI/Controller/CKlearControllerSchedulerOverview.cpp:75:31: note: in expansion of macro ‘__LOC__’
e.addShowException( __LOC__, i18n("Could not create ControllerScheduler dialog." ));
^
build/src/GUI/Controller/CKlearControllerSchedulerOverview.cpp: In member function ‘void CKlearControllerSchedulerOverview::slotAddRecordSet(QString, QDateTime, QDateTime, QString)’:
build/src/GUI/Controller/./../../App/././Exceptions/CKlearAppException.h:23:117: error: cannot call constructor ‘QString::QString’ directly [-fpermissive]
#define __LOC__ "At line "+QString::QString(QString::number(__LINE__)+" in file "+__FILE__+" and function "+__FUNC__)
^
build/src/GUI/Controller/CKlearControllerSchedulerOverview.cpp:93:31: note: in expansion of macro ‘__LOC__’
e.addShowException( __LOC__, i18n("Could not create ControllerScheduler dialog.") );
^
build/src/GUI/Controller/./../../App/././Exceptions/CKlearAppException.h:23:117: error: for a function-style cast, remove the redundant ‘::QString’ [-fpermissive]
#define __LOC__ "At line "+QString::QString(QString::number(__LINE__)+" in file "+__FILE__+" and function "+__FUNC__)
^
build/src/GUI/Controller/CKlearControllerSchedulerOverview.cpp:93:31: note: in expansion of macro ‘__LOC__’
e.addShowException( __LOC__, i18n("Could not create ControllerScheduler dialog.") );
^
build/src/GUI/Controller/CKlearControllerSchedulerOverview.cpp: In member function ‘virtual void CKlearControllerSchedulerOverview::slotRemoveRecordSet()’:
build/src/GUI/Controller/./../../App/././Exceptions/CKlearAppException.h:23:117: error: cannot call constructor ‘QString::QString’ directly [-fpermissive]
#define __LOC__ "At line "+QString::QString(QString::number(__LINE__)+" in file "+__FILE__+" and function "+__FUNC__)
^
build/src/GUI/Controller/CKlearControllerSchedulerOverview.cpp:146:28: note: in expansion of macro ‘__LOC__’
e.addShowException( __LOC__, i18n("Could not save recordsets to disk \n") );
^
build/src/GUI/Controller/./../../App/././Exceptions/CKlearAppException.h:23:117: error: for a function-style cast, remove the redundant ‘::QString’ [-fpermissive]
#define __LOC__ "At line "+QString::QString(QString::number(__LINE__)+" in file "+__FILE__+" and function "+__FUNC__)
^
build/src/GUI/Controller/CKlearControllerSchedulerOverview.cpp:146:28: note: in expansion of macro ‘__LOC__’
e.addShowException( __LOC__, i18n("Could not save recordsets to disk \n") );
^
scons: *** [build/src/GUI/Controller/CKlearControllerSchedulerOverview.o] Error 1
scons: building terminated because of errors.""
how can resolve them?? - May 16 2013