profile-image

faldo

siggi kraus
Birthday List

Plasma 4 Widgets 26 comments

Score 73%
73 Likes
27 Dislikes
Mar 26 2013
Thank you, that works.
Once again ... great app ! - Mar 25 2010
Thank you for creating this app.
I've got a problem with the column width of the name. Names with more than ten letters are not shown completly.For that the colunms of age and date could be smaller.
So far I can not find a way to resize columns.

Many greetings

faldo


- Mar 24 2010
K Birthday Reminder

Plasma 4 Widgets 31 comments

Score 73%
73 Likes
27 Dislikes
Jan 01 2014
That works, thank you !!!
There is still one (liitle) problem left.
When I try to activate this plamoid with clicking on the >Add Widget< button the desktop freezes. But via drag-and-drop it works fine.

btw: How can I help to translate your plasmoid in German?

faldo - Feb 09 2009
That works, thank you !!!
There is still one (liitle) problem left.
When I try to activate this plamoid with clicking on the >Add Widget< button the desktop freezes. But via drag-and-drop it works fine.

btw: How can I help to translate your plasmoid in German?

faldo - Feb 09 2009
Meanwhile I have updated to KDE 4.2
The installation of plasmoid-birthdayreminder-0.9.70-1.0.i586.rpm works but when I start this plasmoid KDE crashes.
Installing birthday-plasmoid-0.9.70.tar.bz2 causes errors:

> CMake Error at /usr/share/kde4/apps/cmake/modules/FindPlasma.cmake:13 (message):
> FindPlasma.cmake is deprecated. Now with KDE 4.2 Plasma is part of kdelibs
> and automatically found using find_package(KDE4) instead.

> Replace the variables previously coming from FindPlasma.cmake as follows:

> PLASMA_OPENGL_FOUND -> KDE4_PLASMA_OPENGL_FOUND

> PLASMA_LIBS -> KDE4_PLASMA_LIBS

> PLASMA_INCLUDE_DIR -> KDE4_INCLUDE_DIR or KDE4_INCLUDES, should be already
> set anyway

> PLASMA_FOUND -> nothing, it's always there if KDE4, version 4.2 or newer
> has been found.

> If you see this error message in a module within KDE/, update it from svn,
> it has been fixed already.

> Call Stack (most recent call first):
> CMakeLists.txt:5 (find_package)


> -- Configuring incomplete, errors occurred!
> error: Bad exit status from /var/tmp/rpm-tmp.73332 (%build)


> RPM build errors:
> Bad exit status from /var/tmp/rpm-tmp.73332 (%build)

The rebuilt via
rpmbuild --rebuild plasmoid-birthdayreminder-0.9.70-1.0.src.rpm takes the same effect.

Are there some packages missing?
What else can I do?
- Feb 08 2009
Hi Moppel

oh yes indeed I meant KDE 4.1.3 - sorry.
I have tried to rebuild the package in your suggested way but it did not work.

After 37% of "make" an error occured.
In the following a part of make.

# In file included from /usr/src/packages/BUILD/KBirthdayPlasma_0_9_70/src/applet/kbirthdayapplet.cpp:1:
/usr/src/packages/BUILD/KBirthdayPlasma_0_9_70/src/applet/kbirthdayapplet.h:42:30: error: Plasma/PopupApplet: Datei oder Verzeichnis nicht gefunden
/usr/src/packages/BUILD/KBirthdayPlasma_0_9_70/src/applet/kbirthdayapplet.cpp:43:29: error: Plasma/IconWidget: Datei oder Verzeichnis nicht gefunden
In file included from /usr/src/packages/BUILD/KBirthdayPlasma_0_9_70/src/applet/kbirthdayapplet.cpp:1:
/usr/src/packages/BUILD/KBirthdayPlasma_0_9_70/src/applet/kbirthdayapplet.h:58: error: expected class-name before ‘{’ token
/usr/src/packages/BUILD/KBirthdayPlasma_0_9_70/src/applet/kbirthdayapplet.h:81: error: ‘KConfigDialog’ has not been declared
/usr/src/packages/BUILD/KBirthdayPlasma_0_9_70/src/applet/kbirthdayapplet.h:136: error: ISO C++ forbids declaration of ‘IconWidget’ with no type
/usr/src/packages/BUILD/KBirthdayPlasma_0_9_70/src/applet/kbirthdayapplet.h:136: error: invalid use of ‘::’
/usr/src/packages/BUILD/KBirthdayPlasma_0_9_70/src/applet/kbirthdayapplet.h:136: error: expected ‘;’ before ‘*’ token
/usr/src/packages/BUILD/KBirthdayPlasma_0_9_70/src/applet/kbirthdayapplet.h:58: warning: ‘class KBirthdayApplet’ has virtual functions and accessible non-virtual destructor
/usr/src/packages/BUILD/KBirthdayPlasma_0_9_70/src/applet/kbirthdayapplet.cpp:52: error: expected constructor, destructor, or type conversion before ‘(’ token
/usr/src/packages/BUILD/KBirthdayPlasma_0_9_70/src/applet/kbirthdayapplet.cpp:56: error: ‘KabEntry’ was not declared in this scope
/usr/src/packages/BUILD/KBirthdayPlasma_0_9_70/src/applet/kbirthdayapplet.cpp:56: error: template argument 1 is invalid
/usr/src/packages/BUILD/KBirthdayPlasma_0_9_70/src/applet/kbirthdayapplet.cpp: In constructor ‘KBirthdayApplet::KBirthdayApplet(QObject*, const QVariantList&)’:
/usr/src/packages/BUILD/KBirthdayPlasma_0_9_70/src/applet/kbirthdayapplet.cpp:64: error: expected class-name before ‘(’ token
/usr/src/packages/BUILD/KBirthdayPlasma_0_9_70/src/applet/kbirthdayapplet.cpp:76: error: ‘DefaultBackground’ was not declared in this scope
/usr/src/packages/BUILD/KBirthdayPlasma_0_9_70/src/applet/kbirthdayapplet.cpp:76: error: ‘setBackgroundHints’ was not declared in this scope
/usr/src/packages/BUILD/KBirthdayPlasma_0_9_70/src/applet/kbirthdayapplet.cpp:77: error: ‘setAspectRatioMode’ was not declared in this scope
/usr/src/packages/BUILD/KBirthdayPlasma_0_9_70/src/applet/kbirthdayapplet.cpp:78: error: ‘setHasConfigurationInterface’ was not declared in this scope
/usr/src/packages/BUILD/KBirthdayPlasma_0_9_70/src/applet/kbirthdayapplet.cpp:79: error: ‘resize’ was not declared in this scope
/usr/src/packages/BUILD/KBirthdayPlasma_0_9_70/src/applet/kbirthdayapplet.cpp: In destructor ‘KBirthdayApplet::~KBirthdayApplet()’:
/usr/src/packages/BUILD/KBirthdayPlasma_0_9_70/src/applet/kbirthdayapplet.cpp:90: error: ‘hasFailedToLaunch’ was not declared in this scope
/usr/src/packages/BUILD/KBirthdayPlasma_0_9_70/src/applet/kbirthdayapplet.cpp: In member function ‘void KBirthdayApplet::init()’:
/usr/src/packages/BUILD/KBirthdayPlasma_0_9_70/src/applet/kbirthdayapplet.cpp:110: error: ‘dataEngine’ was not declared in this scope
/usr/src/packages/BUILD/KBirthdayPlasma_0_9_70/src/applet/kbirthdayapplet.cpp:112: error: no matching function for call to ‘Plasma::DataEngine::connectSource(const char*&, KBirthdayApplet* const)’
/usr/include/KDE/Plasma/../../plasma/dataengine.h:136: note: candidates are: void Plasma::DataEngine::connectSource(const QString&, QObject*, uint, Plasma::IntervalAlignment) const
/usr/src/packages/BUILD/KBirthdayPlasma_0_9_70/src/applet/kbirthdayapplet.cpp:113: error: no matching function for call to ‘Plasma::DataEngine::connectSource(const char*&, KBirthdayApplet* const)’
/usr/include/KDE/Plasma/../../plasma/dataengine.h:136: note: candidates are: void Plasma::DataEngine::connectSource(const QString&, QObject*, uint, Plasma::IntervalAlignment) const
/usr/src/packages/BUILD/KBirthdayPlasma_0_9_70/src/applet/kbirthdayapplet.cpp:116: error: ‘setFailedToLaunch’ was not declared in this scope
/usr/src/packages/BUILD/KBirthdayPlasma_0_9_70/src/applet/kbirthdayapplet.cpp:120: error: no matching function for call to ‘Plasma::DataEngine::connectSource(const char [4], KBirthdayApplet* const, int, Plasma::IntervalAlignment)’
/usr/include/KDE/Plasma/../../plasma/dataengine.h:136: note: candidates are: void Plasma::DataEngine::connectSource(const QString&, QObject*, uint, Plasma::IntervalAlignment) const
/usr/src/packages/BUILD/KBirthdayPlasma_0_9_70/src/applet/kbirthdayapplet.cpp:125: error: ‘config’ was not declared in this scope
/usr/src/packages/BUILD/KBirthdayPlasma_0_9_70/src/applet/kbirthdayapplet.cpp:134: error: no matching function for call to ‘Plasma::Svg::Svg(KBirthdayApplet* const)’
/usr/include/KDE/Plasma/../../plasma/svg.h:73: note: candidates are: Plasma::Svg::Svg(QObject*)
/usr/include/KDE/Plasma/../../plasma/svg.h:51: note: Plasma::Svg::Svg(const Plasma::Svg&)
/usr/src/packages/BUILD/KBirthdayPlasma_0_9_70/src/applet/kbirthdayapplet.cpp: In member function ‘void KBirthdayApplet::constraintsEvent(Plasma::Constraints)’:
/usr/src/packages/BUILD/KBirthdayPlasma_0_9_70/src/applet/kbirthdayapplet.cpp:152: error: ‘formFactor’ was not declared in this scope
/usr/src/packages/BUILD/KBirthdayPlasma_0_9_70/src/applet/kbirthdayapplet.cpp:154: error: ‘setMinimumSize’ was not declared in this scope
/usr/src/packages/BUILD/KBirthdayPlasma_0_9_70/src/applet/kbirthdayapplet.cpp:155: error: ‘setAspectRatioMode’ was not declared in this scope
/usr/src/packages/BUILD/KBirthdayPlasma_0_9_70/src/applet/kbirthdayapplet.cpp: In member function ‘void KBirthdayApplet::paintInterface(QPainter*, const QStyleOptionGraphicsItem*, const QRect&)’:
/usr/src/packages/BUILD/KBirthdayPlasma_0_9_70/src/applet/kbirthdayapplet.cpp:207: error: ‘setMinimumSize’ was not declared in this scope
/usr/src/packages/BUILD/KBirthdayPlasma_0_9_70/src/applet/kbirthdayapplet.cpp: At global scope:
/usr/src/packages/BUILD/KBirthdayPlasma_0_9_70/src/applet/kbirthdayapplet.cpp:272: error: prototype for ‘void KBirthdayApplet::createConfigurationInterface(KConfigDialog*)’ does not match any in class ‘KBirthdayApplet’
/usr/src/packages/BUILD/KBirthdayPlasma_0_9_70/src/applet/kbirthdayapplet.h:81: error: candidate is: void KBirthdayApplet::createConfigurationInterface(int*)
/usr/src/packages/BUILD/KBirthdayPlasma_0_9_70/src/applet/kbirthdayapplet.cpp: In member function ‘void KBirthdayApplet::configAccepted()’:
/usr/src/packages/BUILD/KBirthdayPlasma_0_9_70/src/applet/kbirthdayapplet.cpp:313: error: ‘config’ was not declared in this scope
/usr/src/packages/BUILD/KBirthdayPlasma_0_9_70/src/applet/kbirthdayapplet.cpp:323: error: ‘update’ was not declared in this scope
/usr/src/packages/BUILD/KBirthdayPlasma_0_9_70/src/applet/kbirthdayapplet.cpp:325: error: ‘configNeedsSaving’ was not declared in this scope
/usr/src/packages/BUILD/KBirthdayPlasma_0_9_70/src/applet/kbirthdayapplet.cpp: In member function ‘void KBirthdayApplet::dataUpdated(const QString&, const QHash<QString, QVariant>&)’:
/usr/src/packages/BUILD/KBirthdayPlasma_0_9_70/src/applet/kbirthdayapplet.cpp:347: error: ‘update’ was not declared in this scope
/usr/src/packages/BUILD/KBirthdayPlasma_0_9_70/src/applet/kbirthdayapplet.cpp: In member function ‘void KBirthdayApplet::updateEventList(const QList<QVariant>&, QList<BListEntry*>**)’:
/usr/src/packages/BUILD/KBirthdayPlasma_0_9_70/src/applet/kbirthdayapplet.cpp:355: error: ‘KabEntry’ was not declared in this scope
/usr/src/packages/BUILD/KBirthdayPlasma_0_9_70/src/applet/kbirthdayapplet.cpp:355: error: expected `;' before ‘ke’
/usr/src/packages/BUILD/KBirthdayPlasma_0_9_70/src/applet/kbirthdayapplet.cpp:356: error: ‘ke’ was not declared in this scope
/usr/src/packages/BUILD/KBirthdayPlasma_0_9_70/src/applet/kbirthdayapplet.cpp:354: warning: unused variable ‘person’
In file included from /usr/src/packages/BUILD/KBirthdayPlasma_0_9_70/src/applet/kbirthdayapplet.cpp:447:
/usr/src/packages/BUILD/KBirthdayPlasma_0_9_70/builddir/src/applet/kbirthdayapplet.moc: At global scope:
/usr/src/packages/BUILD/KBirthdayPlasma_0_9_70/builddir/src/applet/kbirthdayapplet.moc:47: error: ‘Plasma::PopupApplet’ has not been declared
/usr/src/packages/BUILD/KBirthdayPlasma_0_9_70/builddir/src/applet/kbirthdayapplet.moc: In member function ‘virtual void* KBirthdayApplet::qt_metacast(const char*)’:
/usr/src/packages/BUILD/KBirthdayPlasma_0_9_70/builddir/src/applet/kbirthdayapplet.moc:61: error: ‘PopupApplet’ in namespace ‘Plasma’ does not name a type
/usr/src/packages/BUILD/KBirthdayPlasma_0_9_70/builddir/src/applet/kbirthdayapplet.moc:62: error: ‘QMocSuperClass’ has not been declared
/usr/src/packages/BUILD/KBirthdayPlasma_0_9_70/builddir/src/applet/kbirthdayapplet.moc: In member function ‘virtual int KBirthdayApplet::qt_metacall(QMetaObject::Call, int, void**)’:
/usr/src/packages/BUILD/KBirthdayPlasma_0_9_70/builddir/src/applet/kbirthdayapplet.moc:67: error: ‘PopupApplet’ in namespace ‘Plasma’ does not name a type
/usr/src/packages/BUILD/KBirthdayPlasma_0_9_70/builddir/src/applet/kbirthdayapplet.moc:68: error: ‘QMocSuperClass’ has not been declared
make[2]: *** [src/applet/CMakeFiles/plasma_applet_kbirthdayapplet.dir/kbirthdayapplet.o] Fehler 1
make[2]: Leaving directory `/usr/src/packages/BUILD/KBirthdayPlasma_0_9_70/builddir'
make[1]: *** [src/applet/CMakeFiles/plasma_applet_kbirthdayapplet.dir/all] Fehler 2
make[1]: Leaving directory `/usr/src/packages/BUILD/KBirthdayPlasma_0_9_70/builddir'
make: *** [all] Fehler 2
error: Bad exit status from /var/tmp/rpm-tmp.530 (%build)


RPM build errors:
user test01 does not exist - using root
user moppel does not exist - using root
Bad exit status from /var/tmp/rpm-tmp.530 (%build)


Do you have any other suggestions?

best regards
faldo - Feb 04 2009
Is there anybody who can help me?
I like this plasmoid and I miss it.
It used to work.

greetings
faldo - Jan 19 2009
Hello

I am working with OpenSUSE 11.1 and KDE 4.3.1

I picked plasmoid-birthdayreminder-0.8.0-4.9.i586.rpm from
http://download.opensuse.org/repositories/KDE%3a/KDE4%3a/Community/openSUSE_11.1/i586/.
I did the installation without problems but when I start this plasmoid plasma crashes.
How can I solve this problem?

- Jan 13 2009
Tellico

Database

by faldo
Score 86%
86 Likes
14 Dislikes
Feb 19 2010
K Birthday Reminder

Plasma 4 Widgets

by faldo
Score 73%
73 Likes
27 Dislikes
Nov 08 2009
GX Mail Notify

Plasma 4 Widgets

by faldo
Score 83%
83 Likes
17 Dislikes
Nov 08 2009
by faldo
Score 77%
77 Likes
23 Dislikes
Sep 17 2009
by faldo
Score 90%
90 Likes
10 Dislikes
Jan 19 2009