Image 01
profile-image

Kalidarn

Unknown Unknown
countdown

Plasma 4 Widgets 18 comments

Score 68%
68 Likes
32 Dislikes
Nov 27 2008
I tried compiling this with:

cmake . -DCMAKE_INSTALL_PREFIX=/usr -DCMAKE_BUILD_TYPE=RELEASE

and then make

I get this error:

[ 33%] Building CXX object src/CMakeFiles/plasma_applet_countdown.dir/countdown.o
cd /home/kalidarn/builds/kdemod-extragear-plasmoid-countdown/src/countdown-0.1/src && /usr/bin/c++ -D_BSD_SOURCE -D_XOPEN_SOURCE=500 -D_BSD_SOURCE -DQT_NO_STL -DQT_NO_CAST_TO_ASCII -D_REENTRANT -DKDE_DEPRECATED_WARNINGS -Dplasma_applet_countdown_EXPORTS -march=i686 -mtune=generic -O2 -pipe -Wnon-virtual-dtor -Wno-long-long -ansi -Wundef -Wcast-align -Wchar-subscripts -Wall -W -Wpointer-arith -Wformat-security -fno-exceptions -fno-check-new -fno-common -Woverloaded-virtual -fno-threadsafe-statics -fvisibility=hidden -fvisibility-inlines-hidden -O2 -DNDEBUG -DQT_NO_DEBUG -fPIC -I/home/kalidarn/builds/kdemod-extragear-plasmoid-countdown/src/countdown-0.1/src -I/home/kalidarn/builds/kdemod-extragear-plasmoid-countdown/src/countdown-0.1 -I/usr/include/KDE -I/usr/include/QtWebKit -I/usr/include/QtHelp -I/usr/include/QtAssistant -I/usr/include/QtDBus -I/usr/include/QtTest -I/usr/include/QtUiTools -I/usr/include/QtScript -I/usr/include/QtSvg -I/usr/include/QtXml -I/usr/include/QtSql -I/usr/include/QtOpenGL -I/usr/include/QtNetwork -I/usr/include/QtDesigner -I/usr/include/Qt3Support -I/usr/include/QtGui -I/usr/include/QtCore -I/usr/include/Qt -I/usr/share/qt/mkspecs/default -D_GNU_SOURCE -D_LARGEFILE64_SOURCE -D_FILE_OFFSET_BITS=64 -o CMakeFiles/plasma_applet_countdown.dir/countdown.o -c /home/kalidarn/builds/kdemod-extragear-plasmoid-countdown/src/countdown-0.1/src/countdown.cpp
/home/kalidarn/builds/kdemod-extragear-plasmoid-countdown/src/countdown-0.1/src/countdown.cpp: In constructor ‘Countdown::Countdown(QObject*, const QVariantList&)’:
/home/kalidarn/builds/kdemod-extragear-plasmoid-countdown/src/countdown-0.1/src/countdown.cpp:57: error: ‘setDrawStandardBackground’ was not declared in this scope
/home/kalidarn/builds/kdemod-extragear-plasmoid-countdown/src/countdown-0.1/src/countdown.cpp: In member function ‘virtual void Countdown::init()’:
/home/kalidarn/builds/kdemod-extragear-plasmoid-countdown/src/countdown-0.1/src/countdown.cpp:87: error: ‘setNeedsConfiguring’ was not declared in this scope
/home/kalidarn/builds/kdemod-extragear-plasmoid-countdown/src/countdown-0.1/src/countdown.cpp:90: error: ‘setMinimumContentSize’ was not declared in this scope
/home/kalidarn/builds/kdemod-extragear-plasmoid-countdown/src/countdown-0.1/src/countdown.cpp: In member function ‘void Countdown::configAccepted()’:
/home/kalidarn/builds/kdemod-extragear-plasmoid-countdown/src/countdown-0.1/src/countdown.cpp:281: error: ‘setNeedsConfiguring’ was not declared in this scope
make[2]: *** [src/CMakeFiles/plasma_applet_countdown.dir/countdown.o] Error 1
make[2]: Leaving directory `/home/kalidarn/builds/kdemod-extragear-plasmoid-countdown/src/countdown-0.1'
make[1]: *** [src/CMakeFiles/plasma_applet_countdown.dir/all] Error 2
make[1]: Leaving directory `/home/kalidarn/builds/kdemod-extragear-plasmoid-countdown/src/countdown-0.1'
make: *** [all] Error 2

Also I'm compiling against KDE 4.1.1 - Sep 02 2008
I Hear U

Telephony 58 comments

Score 86%
86 Likes
14 Dislikes
Jan 30 2008
Yeah i heard there's a windows effort to port KDE libraries etc to windows.

We want to avoid KDE3 dependencies like DCOP thanks. Eventually KDE3 won't be supported anymore. - Feb 01 2008
GANT

Icon Themes 16 comments

Score 76%
76 Likes
24 Dislikes
Aug 04 2007
crap link is dead =) please fix it - Jul 31 2007
kchmviewer

Utilities 103 comments

Score 85%
85 Likes
15 Dislikes
Jan 14 2011
I suppose that can work, but it would be quicker especially when your using programming tutor books if you could simply control-c control-v :P - Dec 08 2006
I found in versions 2.5, 2.6, and now 2.7 (they are the only versions I have used), I cannot copy paste text out of my .chm file.

I tested it on Debian and on Gentoo. - Dec 07 2006