profile-image

M3t4linux

Frédéric Marécaille Tourcoing, France
Air-oxygen

Aurorae Themes 61 comments

Score 86%
86 Likes
14 Dislikes
Jun 06 2010
this package is not on my Debian/sid

I've downloaded the source with your link but the compilation failed...

I prefer to wait it present on the Debian repositories... - Jan 20 2010
Thanks for your fast reply!!

Aurorae is not installed on my Debian

How install it please?

I don't find any package with 'aptitude search aurorae'

Excuse me for all the questions, I'm a newbie concerning customisation... - Jan 19 2010
It's the first window decoration I want to install for ma Debian/sid but I don't now how adding it in my system settings

Thanks - Jan 19 2010
KStreamRipper

Radio Apps 53 comments

Score 85%
85 Likes
15 Dislikes
Sep 08 2011
Thanks, it works fine now - Nov 25 2009
Hi!!

Here the message below during the make command :

CMakeFiles/kradioripper.dir/radiostation/service_classes/proxyinfo.o: In function `proxyinfo::~proxyinfo()':
proxyinfo.cpp:(.text+0x57): undefined reference to `px_proxy_factory_free(_pxProxyFactory*)'
CMakeFiles/kradioripper.dir/radiostation/service_classes/proxyinfo.o: In function `proxyinfo::proxyinfo()':
proxyinfo.cpp:(.text+0x81): undefined reference to `px_proxy_factory_new()'
CMakeFiles/kradioripper.dir/radiostation/service_classes/proxyinfo.o: In function `proxyinfo::proxyinfo()':
proxyinfo.cpp:(.text+0xd1): undefined reference to `px_proxy_factory_new()'
CMakeFiles/kradioripper.dir/radiostation/service_classes/proxyinfo.o: In function `proxyinfo::internal_proxyserver(QString const&) const':
proxyinfo.cpp:(.text+0x228): undefined reference to `px_proxy_factory_get_proxies(_pxProxyFactory*, char*)'
CMakeFiles/kradioripper.dir/radiostation/service_classes/proxyinfo.o: In function `proxyinfo::~proxyinfo()':
proxyinfo.cpp:(.text+0x14): undefined reference to `px_proxy_factory_free(_pxProxyFactory*)'
CMakeFiles/kradioripper.dir/radiostation/service_classes/proxyinfo.o: In function `proxyinfo::~proxyinfo()':
proxyinfo.cpp:(.text+0x34): undefined reference to `px_proxy_factory_free(_pxProxyFactory*)'
collect2: ld returned 1 exit status
make[2]: *** [src/kradioripper] Erreur 1
make[1]: *** [src/CMakeFiles/kradioripper.dir/all] Erreur 2
make: *** [all] Erreur 2

I don't understand what it miss

It relates from libproxy, no? - Nov 24 2009
translatoid

Plasma 4 Widgets 284 comments

by dridk
Score 86%
86 Likes
14 Dislikes
Nov 30 2010
I'm on Debian sid and I have to install
libqjson-dev for compiling it

And it works perfectly!! - Nov 19 2009
Flags don't appears on the translatoid applet

Instead of flags, there's a question mark's icon

Like the icon...

Here a screenshot for your comprehension

http://pix.toile-libre.org/?img=1250112199.png

http://pix.toile-libre.org/?img=1250112385.png

this application is great, and it works very well... - Aug 12 2009
Customizable Weather Plasmoid (CWP)

Plasma 4 Widgets 1069 comments

Score 92%
92 Likes
8 Dislikes
Sep 02 2017
It Works very fine now!!

A big thanks to you ;-) - Oct 14 2009
My distribution GNU/Linux is a Debian sid

What are the kde-devel packages I have to install please??

Thanks a lot - Oct 13 2009
Hello!!

Here the error message appears during the cmake compilation :

-- The C compiler identification is GNU
-- The CXX compiler identification is GNU
-- Check for working C compiler: /usr/bin/gcc
-- Check for working C compiler: /usr/bin/gcc -- works
-- Detecting C compiler ABI info
-- Detecting C compiler ABI info - done
-- Check for working CXX compiler: /usr/bin/c++
-- Check for working CXX compiler: /usr/bin/c++ -- works
-- Detecting CXX compiler ABI info
-- Detecting CXX compiler ABI info - done
CMake Error at /usr/share/cmake-2.6/Modules/FindKDE4.cmake:84 (MESSAGE):
ERROR: cmake/modules/FindKDE4Internal.cmake not found in
/home/unit/.kde/share/apps;/usr/share/kde4/apps
Call Stack (most recent call first):
CMakeLists.txt:5 (find_package)

What it missing please??

Thanks you in advance - Oct 13 2009
GwenRename

Utilities 40 comments

Score 83%
83 Likes
17 Dislikes
Apr 15 2010
Hello!!

I've installed your gwenrename app but here the message box it appears after put a directory

"The program could not find some icons that are necessary for its execution. Please check your installation"

After clicking on "Ok", appr launch but it missing icons - Oct 05 2009
Tellico

Database 160 comments

by robby
Score 86%
86 Likes
14 Dislikes
Nov 22 2016
Hello!

I am very interested in this program but I do not know how to install

It looks to be a good alternative to GCStar ;-)

Thanks in advance for your response - Sep 21 2009
Plasmacon

Plasma 4 Widgets 106 comments

Score 89%
89 Likes
11 Dislikes
Sep 20 2012
Thanks you very much, it works perfectly now!! - Sep 21 2009
I've installer this plasmoid, but I encounter an error message :"Failed to install Script"

My OS is a Debian sid and I've installed :
Python-dev
Python-kde4
Python-kde4-dev
Plasma-scriptengine-python

Why this error message please?

A french user - Sep 18 2009
Star Field Plasma Wallpaper

Plasma 4 Widgets 47 comments

Score 77%
77 Likes
23 Dislikes
Jan 20 2013
Yes, effectively it work better with this package ! !

I'm going to learn to read a README file ;-) - Aug 27 2009
Here the new error message during the compilation :

m3t4linux@debian:~/Software/starfield wallpaper$ ./install.sh
-- The C compiler identification is GNU
-- The CXX compiler identification is GNU
-- Check for working C compiler: /usr/bin/gcc
-- Check for working C compiler: /usr/bin/gcc -- works
-- Detecting C compiler ABI info
-- Detecting C compiler ABI info - done
-- Check for working CXX compiler: /usr/bin/c++
-- Check for working CXX compiler: /usr/bin/c++ -- works
-- Detecting CXX compiler ABI info
-- Detecting CXX compiler ABI info - done
-- Looking for Q_WS_X11
-- Looking for Q_WS_X11 - found
-- Looking for Q_WS_WIN
-- Looking for Q_WS_WIN - not found.
-- Looking for Q_WS_QWS
-- Looking for Q_WS_QWS - not found.
-- Looking for Q_WS_MAC
-- Looking for Q_WS_MAC - not found.
-- Found Qt-Version 4.5.2 (using /usr/bin/qmake)
-- Looking for XOpenDisplay in /usr/lib/libX11.so;/usr/lib/libXext.so;/usr/lib/libXft.so;/usr/lib/libXau.so;/usr/lib/libXdmcp.so
-- Looking for XOpenDisplay in /usr/lib/libX11.so;/usr/lib/libXext.so;/usr/lib/libXft.so;/usr/lib/libXau.so;/usr/lib/libXdmcp.so - found
-- Looking for gethostbyname
-- Looking for gethostbyname - found
-- Looking for connect
-- Looking for connect - found
-- Looking for remove
-- Looking for remove - found
-- Looking for shmat
-- Looking for shmat - found
-- Looking for IceConnectionNumber in ICE
-- Looking for IceConnectionNumber in ICE - found
-- Found X11: /usr/lib/libX11.so
-- Looking for include files CMAKE_HAVE_PTHREAD_H
-- Looking for include files CMAKE_HAVE_PTHREAD_H - found
-- Looking for pthread_create in pthreads
-- Looking for pthread_create in pthreads - not found
-- Looking for pthread_create in pthread
-- Looking for pthread_create in pthread - found
-- Found Threads: TRUE
-- Found Automoc4: /usr/bin/automoc4
-- Found Perl: /usr/bin/perl
-- Phonon Version: 4.3.1
-- Found Phonon: /usr/lib/libphonon.so
-- Found Phonon Includes: /usr/include/qt4/KDE;/usr/include/qt4
-- Performing Test _OFFT_IS_64BIT
-- Performing Test _OFFT_IS_64BIT - Failed
-- Performing Test HAVE_FPIE_SUPPORT
-- Performing Test HAVE_FPIE_SUPPORT - Success
-- Performing Test __KDE_HAVE_W_OVERLOADED_VIRTUAL
-- Performing Test __KDE_HAVE_W_OVERLOADED_VIRTUAL - Success
-- Performing Test __KDE_HAVE_GCC_VISIBILITY
-- Performing Test __KDE_HAVE_GCC_VISIBILITY - Success
-- Found KDE 4.3 include dir: /usr/include
-- Found KDE 4.3 library dir: /usr/lib
-- Found the KDE4 kconfig_compiler preprocessor: /usr/bin/kconfig_compiler
-- Found automoc4: /usr/bin/automoc4
CMake Error at /usr/share/cmake-2.6/Modules/FindPackageHandleStandardArgs.cmake:57 (MESSAGE):
Could NOT find KDE4Workspace (missing: KDE4Workspace_CONFIG)
Call Stack (most recent call first):
/usr/share/kde4/apps/cmake/modules/FindKDE4Workspace.cmake:70 (find_package_handle_standard_args)
CMakeLists.txt:4 (find_package)


-- Configuring incomplete, errors occurred!

And the result of 'aptitude search workspace' :

m3t4linux@debian:~/Software/starfield wallpaper/build$ aptitude search workspace
p gworkspace-apps-wrappers - Application wrappers for GWorkspace
p gworkspace.app - GNUstep Workspace Manager
i A kdebase-workspace - base workspace components from the official KDE 4 release
i A kdebase-workspace-bin - core binaries for the KDE 4 base workspace module
i A kdebase-workspace-data - shared data files for the KDE 4 base workspace module
p kdebase-workspace-dbg - debugging symbols for the KDE 4 base workspace module
p kdebase-workspace-dev - development files for the KDE 4 base workspace module
i A kdebase-workspace-kgreet-plugins - KDE greet libraries for authentication
c kdebase-workspace-libs4+5 - libraries provided by the KDE 4 base workspace module
i A libkworkspace4 - Library for the kdebase workspace
i A plasma-dataengines-workspace - KDE 4 base workspace Plasma data engines
i A plasma-widgets-workspace - KDE 4 base workspace Plasma widgets and containments

I should installing a specific package?? - Aug 26 2009
During the installation, here the error message with the compilation :

/home/m3t4linux/Software/starfield-wallpaper-0.4/src/starfield.cpp:34:37: error: taskmanager/taskmanager.h: Aucun fichier ou dossier de ce type
/home/m3t4linux/Software/starfield-wallpaper-0.4/src/starfield.cpp:67: error: ‘TaskManager’ has not been declared
/home/m3t4linux/Software/starfield-wallpaper-0.4/src/starfield.cpp:68: error: ‘TaskManager’ has not been declared
/home/m3t4linux/Software/starfield-wallpaper-0.4/src/starfield.cpp:69: error: ‘TaskManager’ has not been declared
/home/m3t4linux/Software/starfield-wallpaper-0.4/src/starfield.cpp: In member function ‘void StarFieldWallpaper::checkWindowStates()’:
/home/m3t4linux/Software/starfield-wallpaper-0.4/src/starfield.cpp:513: error: ‘TaskManager’ has not been declared
/home/m3t4linux/Software/starfield-wallpaper-0.4/src/starfield.cpp:513: error: expected `;' before ‘allTasks’
/home/m3t4linux/Software/starfield-wallpaper-0.4/src/starfield.cpp:514: error: ‘allTasks’ was not declared in this scope
/home/m3t4linux/Software/starfield-wallpaper-0.4/src/starfield.cpp:514: error: template argument 1 is invalid
/home/m3t4linux/Software/starfield-wallpaper-0.4/src/starfield.cpp:514: error: invalid type in declaration before ‘(’ token
/home/m3t4linux/Software/starfield-wallpaper-0.4/src/starfield.cpp:514: error: request for member ‘brk’ in ‘_container_’, which is of non-class type ‘int’
/home/m3t4linux/Software/starfield-wallpaper-0.4/src/starfield.cpp:514: error: request for member ‘i’ in ‘_container_’, which is of non-class type ‘int’
/home/m3t4linux/Software/starfield-wallpaper-0.4/src/starfield.cpp:514: error: request for member ‘e’ in ‘_container_’, which is of non-class type ‘int’
/home/m3t4linux/Software/starfield-wallpaper-0.4/src/starfield.cpp:514: error: request for member ‘brk’ in ‘_container_’, which is of non-class type ‘int’
/home/m3t4linux/Software/starfield-wallpaper-0.4/src/starfield.cpp:514: error: request for member ‘i’ in ‘_container_’, which is of non-class type ‘int’
/home/m3t4linux/Software/starfield-wallpaper-0.4/src/starfield.cpp:514: error: ‘TaskManager’ has not been declared
/home/m3t4linux/Software/starfield-wallpaper-0.4/src/starfield.cpp:514: error: expected `;' before ‘task’
/home/m3t4linux/Software/starfield-wallpaper-0.4/src/starfield.cpp:514: error: request for member ‘brk’ in ‘_container_’, which is of non-class type ‘int’
/home/m3t4linux/Software/starfield-wallpaper-0.4/src/starfield.cpp:515: error: ‘task’ was not declared in this scope
/home/m3t4linux/Software/starfield-wallpaper-0.4/src/starfield.cpp:519: error: ‘task’ was not declared in this scope
make[2]: *** [CMakeFiles/plasma_wallpaper_starfield.dir/starfield.o] Erreur 1
make[1]: *** [CMakeFiles/plasma_wallpaper_starfield.dir/all] Erreur 2
make: *** [all] Erreur 2

What can I do to solve this error please?

I use KDE 4.3 on Debian sid

Thanks!! - Aug 25 2009
MameExecutor

Games Other 53 comments

Score 76%
76 Likes
24 Dislikes
Jun 12 2009
Hello ;-)

Really, Big Thanks to you!!

It works perfectly, the compilation was very well...

I think it was miss something in the "cmake..." syntax

Excuse me for my english, I'm french ;-) - Jul 17 2009
Hello!!

There is an error message during the make compilation :

m3t4linux@debian:~/Kget/mameexecutor-1.01$ make
[ 3%] Built target mameexecutor_automoc
[ 3%] Building CXX object CMakeFiles/mameexecutor.dir/mameexecutor_automoc.o
In file included from /home/m3t4linux/Kget/mameexecutor-1.01/src/mainview.h:33,
from /home/m3t4linux/Kget/mameexecutor-1.01/src/mainwindow.h:29,
from /home/m3t4linux/Kget/mameexecutor-1.01/moc_mainwindow.cpp:10,
from /home/m3t4linux/Kget/mameexecutor-1.01/mameexecutor_automoc.cpp:7:
/home/m3t4linux/Kget/mameexecutor-1.01/ui_mainview.h:35:30: error: ../src/imageview.h: Aucun fichier ou dossier de ce type
In file included from /home/m3t4linux/Kget/mameexecutor-1.01/src/mainview.h:33,
from /home/m3t4linux/Kget/mameexecutor-1.01/src/mainwindow.h:29,
from /home/m3t4linux/Kget/mameexecutor-1.01/moc_mainwindow.cpp:10,
from /home/m3t4linux/Kget/mameexecutor-1.01/mameexecutor_automoc.cpp:7:
/home/m3t4linux/Kget/mameexecutor-1.01/ui_mainview.h:82: error: ISO C++ forbids declaration of ‘ImageView’ with no type
/home/m3t4linux/Kget/mameexecutor-1.01/ui_mainview.h:82: error: expected ‘;’ before ‘*’ token
/home/m3t4linux/Kget/mameexecutor-1.01/ui_mainview.h:85: error: ISO C++ forbids declaration of ‘ImageView’ with no type
/home/m3t4linux/Kget/mameexecutor-1.01/ui_mainview.h:85: error: expected ‘;’ before ‘*’ token
/home/m3t4linux/Kget/mameexecutor-1.01/ui_mainview.h:88: error: ISO C++ forbids declaration of ‘ImageView’ with no type
/home/m3t4linux/Kget/mameexecutor-1.01/ui_mainview.h:88: error: expected ‘;’ before ‘*’ token
/home/m3t4linux/Kget/mameexecutor-1.01/ui_mainview.h: In member function ‘void Ui_MainView::setupUi(QWidget*)’:
/home/m3t4linux/Kget/mameexecutor-1.01/ui_mainview.h:291: error: ‘titleImageView’ was not declared in this scope
/home/m3t4linux/Kget/mameexecutor-1.01/ui_mainview.h:291: error: expected type-specifier before ‘ImageView’
/home/m3t4linux/Kget/mameexecutor-1.01/ui_mainview.h:291: error: expected `;' before ‘ImageView’
/home/m3t4linux/Kget/mameexecutor-1.01/ui_mainview.h:301: error: ‘flyerImageView’ was not declared in this scope
/home/m3t4linux/Kget/mameexecutor-1.01/ui_mainview.h:301: error: expected type-specifier before ‘ImageView’
/home/m3t4linux/Kget/mameexecutor-1.01/ui_mainview.h:301: error: expected `;' before ‘ImageView’
/home/m3t4linux/Kget/mameexecutor-1.01/ui_mainview.h:311: error: ‘cabinetImageView’ was not declared in this scope
/home/m3t4linux/Kget/mameexecutor-1.01/ui_mainview.h:311: error: expected type-specifier before ‘ImageView’
/home/m3t4linux/Kget/mameexecutor-1.01/ui_mainview.h:311: error: expected `;' before ‘ImageView’
make[2]: *** [CMakeFiles/mameexecutor.dir/mameexecutor_automoc.o] Erreur 1
make[1]: *** [CMakeFiles/mameexecutor.dir/all] Erreur 2
make: *** [all] Erreur 2

Can you tell me what I have to do please?

Your soft looks like very good ;-) - Jul 11 2009
KAudioCreator

Utilities 43 comments

Score 75%
75 Likes
25 Dislikes
Sep 03 2011
Hello!!

I've just installer this package on my Debian sid and it works perferctly

I'm very happy to (re) use this software on Debian KDE 4.2; it's not present on the sid depositery and I live very much Kaudiocreator

Simply thnks you!!

A french user ;-) - Jul 11 2009
Photolets

Karamba & Superkaramba 11 comments

Score 70%
70 Likes
30 Dislikes
Apr 20 2008
Hello!!

The file is an "skz" file

How can I use it with superkaramba please??

Do I have to save it under an other format??

Thanks ;-) - Jul 22 2008
FC-Monitor-KDE3 (FR, EN_US)

Karamba & Superkaramba 4 comments

Score 61%
61 Likes
39 Dislikes
Mar 07 2009
Super ce moniteur!!!

Perso, j'ai rajouté dans le trafic réseau mon adresse ip public ;-)

Mais le trafic des paquets reçus et envoyés ne fonctionnent pas, j'ai pourtant changé mon interface réseau eth1 i/o eth0

Que faut-il paramétrer de plus??

Merci :-) - Jul 22 2008
Hacker Evolution KDE Theme

KDE 3.5 Themes 3 comments

Score 64%
64 Likes
36 Dislikes
Jan 13 2008
I like very much this theme but in openoffice calc, it's impossible to make dynamic cross chart (i hope you understand, i'm a french ;-) because there isn't buttons...

These theme will not compatible with this Ooo Calc's option??

Thanks you for your eventual answers.. - Feb 24 2008
KStreamRipper

Radio Apps

Score 85%
85 Likes
15 Dislikes
Nov 25 2009
KPassGen

Security

Score 65%
65 Likes
35 Dislikes
Nov 19 2009
K3b Oxygen

K3b Themes

Score 53%
53 Likes
47 Dislikes
Oct 22 2009
Tellico

Database

by robby
Score 86%
86 Likes
14 Dislikes
Oct 14 2009
Minitube

TV & Streaming

Score 84%
84 Likes
16 Dislikes
Oct 14 2009
Device Information KCM

System Software

Score 80%
80 Likes
20 Dislikes
Oct 14 2009
KBackup

System Software

Score 78%
78 Likes
22 Dislikes
Oct 05 2009
MameExecutor

Games Other

Score 76%
76 Likes
24 Dislikes
Sep 21 2009
GwenRename

Utilities

Score 83%
83 Likes
17 Dislikes
Sep 21 2009
Audex

Utilities

Score 90%
90 Likes
10 Dislikes
Sep 21 2009
Score 92%
92 Likes
8 Dislikes
Aug 26 2009
translatoid

Plasma 4 Widgets

by dridk
Score 86%
86 Likes
14 Dislikes
Aug 18 2009
Daisy

Plasma 4 Widgets

Score 91%
91 Likes
9 Dislikes
Aug 12 2009
Lancelot

KDE 1.-4. Improvements

Score 86%
86 Likes
14 Dislikes
Aug 12 2009
KAudioCreator

Utilities

Score 75%
75 Likes
25 Dislikes
Jul 11 2009