Image 01
profile-image

portnoyboy

Portnoy Boy Depok, Indonesia
Get YouTube Video (improved)

Konqueror 110 comments

by panzi
Score 62.0%
May 04 2012
Hi, i downloaded the source, extracted, ran "sudo ./install-kde4.sh", and i got these errors:

Quote:
install: cannot stat `get_yt_video-kde4.py': No such file or directory

install: cannot stat `get_yt_video-kde4.desktop': No such file or directory

Here is the file list in youtube-servicemenu-1.8 directory:
Changelog
get_yt_video.desktop
get_yt_video-old.desktop
get_yt_video.py
install-kde3.sh
install-kde4.sh
l10n
LICENSE
mkrpm.py
mktar.sh
README

Should i edit install-kde4.sh to use get_yt_video.desktop and get_yt_video.py instead?

I'm using PCLinuxOS 2010 (KDE4)

Thanks! - May 28 2010
soundKonverter

Audio Extractors/Converters 606 comments

Score 87.6%
Oct 01 2017
Hi, thx 4 d quick reply :) yup, i havent installed taglib-devel, so i installed it but when i run make again, i got the same problem as rickz'.

As you suggested i removed all references to the audible plugin from the tplugins.cpp using text editor. But how can i "exclude it from the build process"? Please bear with me, i'm really new to linux :) Thx

p.s.
Anyway after making changes in tplugins.cpp, i ran 'make' again and i got different error. Made some changes, then getting errors again. I tried to follow those errors and end up editing following files:
*audible*.cpp
wavfile.cpp
wavproperties.cpp
wavfiletyperesolver.cpp
cdmanager.cpp
paranoia.cpp
... until i gave up :) Btw the error messages are similar: "'something' was not declared in this scope". Cdmanager & paranoia gave different errors though.
- Sep 21 2009
Hi, thx 4 d quick reply :) yup, i havent installed taglib-devel, so i installed it but when i run make again, i got the same problem as rickz'.

As you suggested i removed all references to the audible plugin from the tplugins.cpp using text editor. But how can i "exclude it from the build process"? Please bear with me, i'm really new to linux :) Thx

p.s.
Anyway after making changes in tplugins.cpp, i ran 'make' again and i got different error. Made some changes, then getting errors again. I tried to follow those errors and end up editing following files:
*audible*.cpp
wavfile.cpp
wavproperties.cpp
wavfiletyperesolver.cpp
cdmanager.cpp
paranoia.cpp
... until i gave up :) Btw the error messages are similar: "'something' was not declared in this scope". Cdmanager & paranoia gave different errors though.
- Sep 20 2009
Hi, i'm running Fedora 11 with KDE 4.3. This is the output of 'make': (sorry i'm a total linux noob, i dont know what all of these mean so i paste all of the output)

Making install in doc
make[1]: Entering directory `/home/shared/packages/sources/soundkonverter-0.3.10/doc'
Making install in .
make[2]: Entering directory `/home/shared/packages/sources/soundkonverter-0.3.10/doc'
make[3]: Entering directory `/home/shared/packages/sources/soundkonverter-0.3.10/doc'
make[3]: Nothing to be done for `install-exec-am'.
make[3]: Nothing to be done for `install-data-am'.
make[3]: Leaving directory `/home/shared/packages/sources/soundkonverter-0.3.10/doc'
make[2]: Leaving directory `/home/shared/packages/sources/soundkonverter-0.3.10/doc'
Making install in en
make[2]: Entering directory `/home/shared/packages/sources/soundkonverter-0.3.10/doc/en'
make[3]: Entering directory `/home/shared/packages/sources/soundkonverter-0.3.10/doc/en'
make[3]: Nothing to be done for `install-exec-am'.
/bin/sh ../../admin/mkinstalldirs /usr/share/doc/HTML/en/soundkonverter
/usr/bin/install -c -p -m 644 index.docbook /usr/share/doc/HTML/en/soundkonverter/index.docbook
/bin/sh ../../admin/mkinstalldirs /usr/share/doc/HTML/en/soundkonverter
/usr/bin/install -c -p -m 644 index.cache.bz2 /usr/share/doc/HTML/en/soundkonverter/
rm -f /usr/share/doc/HTML/en/soundkonverter/common
ln -s /usr/share/doc/HTML/en/common /usr/share/doc/HTML/en/soundkonverter/common
make[3]: Leaving directory `/home/shared/packages/sources/soundkonverter-0.3.10/doc/en'
make[2]: Leaving directory `/home/shared/packages/sources/soundkonverter-0.3.10/doc/en'
make[1]: Leaving directory `/home/shared/packages/sources/soundkonverter-0.3.10/doc'
Making install in po
make[1]: Entering directory `/home/shared/packages/sources/soundkonverter-0.3.10/po'
make[2]: Entering directory `/home/shared/packages/sources/soundkonverter-0.3.10/po'
make[2]: Nothing to be done for `install-exec-am'.
/usr/bin/install -c -p -m 644 pl.gmo /usr/share/locale/pl/LC_MESSAGES/soundkonverter.mo
/usr/bin/install -c -p -m 644 pt_PT.gmo /usr/share/locale/pt_PT/LC_MESSAGES/soundkonverter.mo
/usr/bin/install -c -p -m 644 sv.gmo /usr/share/locale/sv/LC_MESSAGES/soundkonverter.mo
/usr/bin/install -c -p -m 644 nl.gmo /usr/share/locale/nl/LC_MESSAGES/soundkonverter.mo
/usr/bin/install -c -p -m 644 ru.gmo /usr/share/locale/ru/LC_MESSAGES/soundkonverter.mo
/usr/bin/install -c -p -m 644 fr.gmo /usr/share/locale/fr/LC_MESSAGES/soundkonverter.mo
/usr/bin/install -c -p -m 644 de.gmo /usr/share/locale/de/LC_MESSAGES/soundkonverter.mo
/usr/bin/install -c -p -m 644 et.gmo /usr/share/locale/et/LC_MESSAGES/soundkonverter.mo
/usr/bin/install -c -p -m 644 pt_BR.gmo /usr/share/locale/pt_BR/LC_MESSAGES/soundkonverter.mo
/usr/bin/install -c -p -m 644 hu.gmo /usr/share/locale/hu/LC_MESSAGES/soundkonverter.mo
/usr/bin/install -c -p -m 644 zh_CN.gmo /usr/share/locale/zh_CN/LC_MESSAGES/soundkonverter.mo
/usr/bin/install -c -p -m 644 it.gmo /usr/share/locale/it/LC_MESSAGES/soundkonverter.mo
/usr/bin/install -c -p -m 644 es.gmo /usr/share/locale/es/LC_MESSAGES/soundkonverter.mo
make[2]: Leaving directory `/home/shared/packages/sources/soundkonverter-0.3.10/po'
make[1]: Leaving directory `/home/shared/packages/sources/soundkonverter-0.3.10/po'
Making install in src
make[1]: Entering directory `/home/shared/packages/sources/soundkonverter-0.3.10/src'
Making install in amarokscript
make[2]: Entering directory `/home/shared/packages/sources/soundkonverter-0.3.10/src/amarokscript'
make[3]: Entering directory `/home/shared/packages/sources/soundkonverter-0.3.10/src/amarokscript'
make[3]: Nothing to be done for `install-exec-am'.
/bin/sh ../../admin/mkinstalldirs /usr/share/apps/soundkonverter/amarokscript
/usr/bin/install -c -p -m 644 README /usr/share/apps/soundkonverter/amarokscript/README
/usr/bin/install -c -p -m 644 soundKonverter.rb /usr/share/apps/soundkonverter/amarokscript/soundKonverter.rb
make[3]: Leaving directory `/home/shared/packages/sources/soundkonverter-0.3.10/src/amarokscript'
make[2]: Leaving directory `/home/shared/packages/sources/soundkonverter-0.3.10/src/amarokscript'
Making install in metadata
make[2]: Entering directory `/home/shared/packages/sources/soundkonverter-0.3.10/src/metadata'
Making install in speex
make[3]: Entering directory `/home/shared/packages/sources/soundkonverter-0.3.10/src/metadata/speex'
make[4]: Entering directory `/home/shared/packages/sources/soundkonverter-0.3.10/src/metadata/speex'
if /bin/sh ../../../libtool --silent --mode=compile --tag=CXX g++ -DHAVE_CONFIG_H -I. -I. -I../../.. -I/usr/include/kde -I/usr/lib/qt-3.3/include -I. -DQT_THREAD_SUPPORT -D_REENTRANT -Wno-long-long -Wundef -ansi -D_XOPEN_SOURCE=500 -D_BSD_SOURCE -Wcast-align -Wconversion -Wchar-subscripts -Wall -W -Wpointer-arith -O2 -Wformat-security -Wmissing-format-attribute -Wno-non-virtual-dtor -fno-exceptions -fno-check-new -fno-common -MT speexfile.lo -MD -MP -MF ".deps/speexfile.Tpo" \
-c -o speexfile.lo `test -f 'speexfile.cpp' || echo './'`speexfile.cpp; \
then mv -f ".deps/speexfile.Tpo" ".deps/speexfile.Plo"; \
else rm -f ".deps/speexfile.Tpo"; exit 1; \
fi
speexfile.cpp:28:21: error: tstring.h: No such file or directory
In file included from speexfile.cpp:33:
speexfile.h:29:21: error: oggfile.h: No such file or directory
speexfile.h:30:25: error: xiphcomment.h: No such file or directory
In file included from speexfile.h:32,
from speexfile.cpp:33:
speexproperties.h:29:29: error: audioproperties.h: No such file or directory
In file included from speexfile.h:32,
from speexfile.cpp:33:
speexproperties.h:45: error: expected class-name before '{' token
speexproperties.h:51: error: 'ReadStyle' has not been declared
speexproperties.h:51: error: 'Average' was not declared in this scope
In file included from speexfile.cpp:33:
speexfile.h:49: error: 'Ogg' has not been declared
speexfile.h:49: error: expected '{' before 'File'
speexfile.h:50: error: invalid type in declaration before '{' token
speexfile.h:50: warning: extended initializer lists only available with -std=c++0x or -std=gnu++0x
speexfile.h:51: error: expected primary-expression before 'public'
speexfile.h:51: error: expected '}' before 'public'
speexfile.h:51: error: expected ',' or ';' before 'public'
speexfile.h:63: error: expected class-name before '(' token
speexfile.h:70: error: 'Ogg' has not been declared
speexfile.h:70: error: expected initializer before '*' token
speexfile.h:76: error: 'virtual' outside class declaration
speexfile.h:76: error: non-member function 'TagLib::Speex::Properties* TagLib::Speex::audioProperties()' cannot have cv-qualifier
speexfile.h:78: error: 'virtual' outside class declaration
speexfile.h:80: error: expected unqualified-id before 'private'
speexfile.h:82: error: expected constructor, destructor, or type conversion before '&' token
speexfile.h:84: error: 'TagLib::Speex::Properties::ReadStyle' has not been declared
speexfile.h:91: error: expected declaration before '}' token
make[4]: *** [speexfile.lo] Error 1
make[4]: Leaving directory `/home/shared/packages/sources/soundkonverter-0.3.10/src/metadata/speex'
make[3]: *** [install-recursive] Error 1
make[3]: Leaving directory `/home/shared/packages/sources/soundkonverter-0.3.10/src/metadata/speex'
make[2]: *** [install-recursive] Error 1
make[2]: Leaving directory `/home/shared/packages/sources/soundkonverter-0.3.10/src/metadata'
make[1]: *** [install-recursive] Error 1
make[1]: Leaving directory `/home/shared/packages/sources/soundkonverter-0.3.10/src'
make: *** [install-recursive] Error 1

Please help, thx! btw looking forward for the KDE4-port, so good luck :) - Sep 19 2009