Image 01
profile-image

seqizz

Gürkan Gür Adana, Turkey
KDE 4 Splashscreens
KDM4 Themes

Arch Logo Green

KDM4 Themes Apr 05 2011
Score 61%
61 Likes
39 Dislikes
Bootsplash Various
KWin Button applet improved

Plasma 4 Widgets 58 comments

by paju
Score 78%
78 Likes
22 Dislikes
Sep 08 2012
I just installed and replaced the original kwinbuttons. But its acting same, no hiding. What could be the problem? (KDE 4.7.0) - Aug 04 2011
Scale Up

Various KDE 1.-4. Improvements 7 comments

Score 62%
62 Likes
38 Dislikes
Apr 14 2010
doesn't compile in kde 4.7:


[ 80%] [100%] Building CXX object CMakeFiles/kcm_kwin4_effect_scaleup.dir/kcm_kwin4_effect_scaleup_automoc.o
Building CXX object CMakeFiles/kcm_kwin4_effect_scaleup.dir/scaleup_config.o
In file included from /tmp/yaourt-tmp-root/aur-kwin-effect-scaleout-git/src/kwin-effect-scaleout/scaleup.cpp:18:0:
/tmp/yaourt-tmp-root/aur-kwin-effect-scaleout-git/src/kwin-effect-scaleout/scaleup.h:41:37: error: ‘TimeLine’ was not declared in this scope
/tmp/yaourt-tmp-root/aur-kwin-effect-scaleout-git/src/kwin-effect-scaleout/scaleup.h:41:46: error: template argument 2 is invalid
/tmp/yaourt-tmp-root/aur-kwin-effect-scaleout-git/src/kwin-effect-scaleout/scaleup.cpp: In member function ‘virtual void KWin::ScaleUpEffect::reconfigure(KWin::Effect::ReconfigureFlags)’:
/tmp/yaourt-tmp-root/aur-kwin-effect-scaleout-git/src/kwin-effect-scaleout/scaleup.cpp:32:18: error: variable ‘KConfigGroup conf’ has initializer but incomplete type
/tmp/yaourt-tmp-root/aur-kwin-effect-scaleout-git/src/kwin-effect-scaleout/scaleup.cpp:32:63: error: invalid use of incomplete type ‘struct KConfigGroup’
/usr/include/kconfigbase.h:32:7: error: forward declaration of ‘struct KConfigGroup’
/tmp/yaourt-tmp-root/aur-kwin-effect-scaleout-git/src/kwin-effect-scaleout/scaleup.cpp: In member function ‘virtual void KWin::ScaleUpEffect::prePaintScreen(KWin::ScreenPrePaintData&, int)’:
/tmp/yaourt-tmp-root/aur-kwin-effect-scaleout-git/src/kwin-effect-scaleout/scaleup.cpp:41:27: error: request for member ‘isEmpty’ in ‘((KWin::ScaleUpEffect*)this)->KWin::ScaleUpEffect::mTimeLineWindows’, which is of non-class type ‘int’
/tmp/yaourt-tmp-root/aur-kwin-effect-scaleout-git/src/kwin-effect-scaleout/scaleup.cpp: In member function ‘virtual void KWin::ScaleUpEffect::prePaintWindow(KWin::EffectWindow*, KWin::WindowPrePaintData&, int)’:
/tmp/yaourt-tmp-root/aur-kwin-effect-scaleout-git/src/kwin-effect-scaleout/scaleup.cpp:48:26: error: request for member ‘contains’ in ‘((KWin::ScaleUpEffect*)this)->KWin::ScaleUpEffect::mTimeLineWindows’, which is of non-class type ‘int’
/tmp/yaourt-tmp-root/aur-kwin-effect-scaleout-git/src/kwin-effect-scaleout/scaleup.cpp:50:31: error: ‘class KWin::EffectWindow’ has no member named ‘addTime’
/tmp/yaourt-tmp-root/aur-kwin-effect-scaleout-git/src/kwin-effect-scaleout/scaleup.cpp:51:35: error: ‘class KWin::EffectWindow’ has no member named ‘value’
/tmp/yaourt-tmp-root/aur-kwin-effect-scaleout-git/src/kwin-effect-scaleout/scaleup.cpp:54:30: error: request for member ‘remove’ in ‘((KWin::ScaleUpEffect*)this)->KWin::ScaleUpEffect::mTimeLineWindows’, which is of non-class type ‘int’
/tmp/yaourt-tmp-root/aur-kwin-effect-scaleout-git/src/kwin-effect-scaleout/scaleup.cpp: In member function ‘virtual void KWin::ScaleUpEffect::paintWindow(KWin::EffectWindow*, int, QRegion, KWin::WindowPaintData&)’:
/tmp/yaourt-tmp-root/aur-kwin-effect-scaleout-git/src/kwin-effect-scaleout/scaleup.cpp:61:26: error: request for member ‘contains’ in ‘((KWin::ScaleUpEffect*)this)->KWin::ScaleUpEffect::mTimeLineWindows’, which is of non-class type ‘int’
/tmp/yaourt-tmp-root/aur-kwin-effect-scaleout-git/src/kwin-effect-scaleout/scaleup.cpp:66:50: error: ‘class KWin::EffectWindow’ has no member named ‘value’
/tmp/yaourt-tmp-root/aur-kwin-effect-scaleout-git/src/kwin-effect-scaleout/scaleup.cpp: In member function ‘virtual void KWin::ScaleUpEffect::postPaintWindow(KWin::EffectWindow*)’:
/tmp/yaourt-tmp-root/aur-kwin-effect-scaleout-git/src/kwin-effect-scaleout/scaleup.cpp:81:26: error: request for member ‘contains’ in ‘((KWin::ScaleUpEffect*)this)->KWin::ScaleUpEffect::mTimeLineWindows’, which is of non-class type ‘int’
/tmp/yaourt-tmp-root/aur-kwin-effect-scaleout-git/src/kwin-effect-scaleout/scaleup.cpp: In member function ‘virtual void KWin::ScaleUpEffect::windowUserMovedResized(KWin::EffectWindow*, bool, bool)’:
/tmp/yaourt-tmp-root/aur-kwin-effect-scaleout-git/src/kwin-effect-scaleout/scaleup.cpp:103:9: error: ‘TimeLine’ was not declared in this scope
/tmp/yaourt-tmp-root/aur-kwin-effect-scaleout-git/src/kwin-effect-scaleout/scaleup.cpp:103:19: error: ‘t’ was not declared in this scope
/tmp/yaourt-tmp-root/aur-kwin-effect-scaleout-git/src/kwin-effect-scaleout/scaleup.cpp:104:26: error: ‘TimeLine’ is not a class or namespace
/tmp/yaourt-tmp-root/aur-kwin-effect-scaleout-git/src/kwin-effect-scaleout/scaleup.cpp: In member function ‘virtual void KWin::ScaleUpEffect::windowClosed(KWin::EffectWindow*)’:
/tmp/yaourt-tmp-root/aur-kwin-effect-scaleout-git/src/kwin-effect-scaleout/scaleup.cpp:118:22: error: request for member ‘remove’ in ‘((KWin::ScaleUpEffect*)this)->KWin::ScaleUpEffect::mTimeLineWindows’, which is of non-class type ‘int’
make[2]: *** [CMakeFiles/kwin4_effect_scaleup.dir/scaleup.o] Error 1
make[1]: *** [CMakeFiles/kwin4_effect_scaleup.dir/all] Error 2
make[1]: *** Waiting for unfinished jobs....
- Aug 03 2011
Gentoo Logo Green KDM4

KDM4 Themes 4 comments

Score 69%
69 Likes
31 Dislikes
Feb 28 2011
sorry for little mistakes :P no time to edit :) - Mar 15 2011
Slim Glow

Plasma Themes 102 comments

Score 85%
85 Likes
15 Dislikes
Dec 31 2012
Because I don't want to emerge the whole package for 1 theme :)

[ebuild N ] kde-base/kdeartwork-desktopthemes-4.6.1
114,148 kB - Mar 05 2011
Quick Usb Formatter

System Software 32 comments

Score 78%
78 Likes
22 Dislikes
Oct 21 2011
Here is the tr.po,
Regards..

http://paste.pocoo.org/show/336661/ - Feb 11 2011
Automated Font Installer

Nautilus Scripts 19 comments

Score 58%
58 Likes
42 Dislikes
Jul 15 2009
# Turkish translation by Gürkan Gür (seqizz) #
##########################################################################
# Language Settings ---------------------------------------------------- #
wait='Yazıtipi öncelleği güncelleniyor, lütfen bekleyin'
title_wait='Bitiriliyor'

errors='Bir hata var'
title_errors='Hata'

# End of language settings ----------------------------------------------# - Jun 29 2008
KFaenza

Icon Themes

Score 78%
78 Likes
22 Dislikes
Sep 09 2011
Daisy

Plasma 4 Widgets

Score 92%
92 Likes
8 Dislikes
Aug 10 2011
Score 48%
48 Likes
52 Dislikes
Oct 18 2015
Score 57%
57 Likes
43 Dislikes
Sep 12 2014
KotenZA

Icon Themes

Score 74%
74 Likes
26 Dislikes
Jul 25 2013
Ponies Everywhere

Plasma 4 Widgets

Score 58%
58 Likes
42 Dislikes
Sep 23 2011
Score 53%
53 Likes
47 Dislikes
Sep 09 2011
krunner-googletranslate

Krunner Plugins

by tcat
Score 63%
63 Likes
37 Dislikes
Aug 09 2011
Night Sky

Wallpaper Other

Score 50%
50 Likes
50 Dislikes
Aug 07 2011
Kopete login window

UI Concepts

by and1
Score 39%
39 Likes
61 Dislikes
Aug 04 2011
Metalized texture template

Various Artwork

Score 50%
50 Likes
50 Dislikes
Aug 04 2011
Athkar

Plasma 4 Widgets

Score 57%
57 Likes
43 Dislikes
Aug 04 2011
Live Desktop

Screensavers

Score 54%
54 Likes
46 Dislikes
Aug 04 2011
Active Application

Plasma 4 Widgets

by avlas
Score 67%
67 Likes
33 Dislikes
Aug 04 2011
Amarok

Audioplayers

Score 85%
85 Likes
15 Dislikes
Aug 04 2011
BusyTasks

Plasma 4 Widgets

Score 71%
71 Likes
29 Dislikes
Aug 04 2011
Androbit

Plasma Themes

Score 84%
84 Likes
16 Dislikes
Aug 03 2011
Fragile

Plasma Themes

Score 75%
75 Likes
25 Dislikes
Aug 03 2011
win-classic

Plasma Themes

Score 67%
67 Likes
33 Dislikes
Aug 03 2011
Titlebar menu

Various KDE 1.-4. Improvements

Score 70%
70 Likes
30 Dislikes
Aug 03 2011
One Pixel Title

Yakuake Skins

Score 54%
54 Likes
46 Dislikes
Jul 24 2011
Score 69%
69 Likes
31 Dislikes
Jul 23 2011
Skulpture

Various Plasma Styles

Score 74%
74 Likes
26 Dislikes
Jul 21 2011
KDE PO Thumbnailer

Various KDE 1.-4. Improvements

by nihui
Score 72%
72 Likes
28 Dislikes
Jul 08 2011
Blue Sora

Plasma Themes

Score 83%
83 Likes
17 Dislikes
Mar 23 2011