Image 01
profile-image

thomasjfedora

Thomas Janssen Frankfurt am Main, Germany
DIfmoid (DI.fm plasmoid)

Plasma 4 Widgets 1 comment

Score 61%
61 Likes
39 Dislikes
Feb 25 2009
Hi, i was trying your plasmoid, but it doesn't run. As the Subject says, the "Script initialization failed"

KDE == 4.6.00
pytz-2010h-3.fc14.noarch
PyQt4-4.8.3-0.2.fc14.x86_64
PyKDE4-4.6.0-0.1.fc14.x86_64
python-2.7-8.fc14.1.x86_64

$ plasmoidviewer difmoid
plasmoidviewer(25105)/libplasma Plasma::FrameSvg::resizeFrame: Invalid size QSizeF(0, 0)
plasmoidviewer(25105)/libplasma Plasma::FrameSvg::resizeFrame: Invalid size QSizeF(0, 0)
Traceback (most recent call last):
File "/usr/share/kde4/apps/plasma_scriptengine_python/pyappletscript.py", line 75, in init
self.pyapplet.init()
File "/home/thomas/.kde/share/apps/plasma/plasmoids/difmoid/contents/code/main.py", line 158, in init
self.load_config()
File "/home/thomas/.kde/share/apps/plasma/plasmoids/difmoid/contents/code/main.py", line 322, in load_config
self.notify_channels_time = int( config.readEntry( u'Notify channels time', u'30' ) )
TypeError: int() argument must be a string or a number, not 'QVariant'

-------------------
BTW, very good idea this plasmoid :) - Feb 15 2011
KParts Plugin

Web & Browser 139 comments

Score 87%
87 Likes
13 Dislikes
Jul 23 2012
For posterity, kpartsplugin is since a long time in Fedora. I'm the packager.

yum install kpartsplugin

BTW, thanks for this great software. - Feb 02 2011
PublicTransport

Plasma 4 Widgets 813 comments

Score 92%
92 Likes
8 Dislikes
Jan 17 2013
Great, wasted space due to my stupidity. I was testing a new svn snapshot of webkitpart and forgot to install the -devel part.. Sorry for that. - May 24 2010
[ 58%] Building CXX object src/CMakeFiles/timetablemate.dir/timetablemateview.o
cd /home/thomas/rpmbuild/BUILD/publictransport-0.8.3_timetablemate-0.2.1/timetablemate-0.2/x86_64-redhat-linux-gnu/src && /usr/lib64/ccache/c++ -D_BSD_SOURCE -O2 -g -pipe -Wall -Wp,-D_FORTIFY_SOURCE=2 -fexceptions -fstack-protector --param=ssp-buffer-size=4 -m64 -mtune=generic -Wnon-virtual-dtor -Wno-long-long -ansi -Wundef -Wcast-align -Wchar-subscripts -Wall -W -Wpointer-arith -Wformat-security -fno-exceptions -DQT_NO_EXCEPTIONS -fno-check-new -fno-common -Woverloaded-virtual -fno-threadsafe-statics -fvisibility=hidden -fvisibility-inlines-hidden -O2 -DNDEBUG -DQT_NO_DEBUG -I/home/thomas/rpmbuild/BUILD/publictransport-0.8.3_timetablemate-0.2.1/timetablemate-0.2/x86_64-redhat-linux-gnu/src -I/home/thomas/rpmbuild/BUILD/publictransport-0.8.3_timetablemate-0.2.1/timetablemate-0.2/src -I/home/thomas/rpmbuild/BUILD/publictransport-0.8.3_timetablemate-0.2.1/timetablemate-0.2 -I/home/thomas/rpmbuild/BUILD/publictransport-0.8.3_timetablemate-0.2.1/timetablemate-0.2/x86_64-redhat-linux-gnu -I/usr/include/kde4 -I/usr/include/kde4/KDE -I/usr/include/KDE -I/usr/include/phonon -I/usr/include/QtXmlPatterns -I/usr/include/QtXml -I/usr/include/QtWebKit -I/usr/include/QtUiTools -I/usr/include/QtTest -I/usr/include/QtSvg -I/usr/include/QtSql -I/usr/include/QtScriptTools -I/usr/include/QtScript -I/usr/include/QtOpenGL -I/usr/include/QtNetwork -I/usr/include/QtMultimedia -I/usr/include/QtHelp -I/usr/include/QtDesigner -I/usr/include/QtDBus -I/usr/include/QtAssistant -I/usr/include/Qt3Support -I/usr/include/QtGui -I/usr/include/QtCore -I/usr/include/Qt -I/usr/lib64/qt4/mkspecs/default -o CMakeFiles/timetablemate.dir/timetablemateview.o -c /home/thomas/rpmbuild/BUILD/publictransport-0.8.3_timetablemate-0.2.1/timetablemate-0.2/src/timetablemateview.cpp
/home/thomas/rpmbuild/BUILD/publictransport-0.8.3_timetablemate-0.2.1/timetablemate-0.2/src/timetablemate.cpp: In constructor 'TimetableMate::TimetableMate()':
/home/thomas/rpmbuild/BUILD/publictransport-0.8.3_timetablemate-0.2.1/timetablemate-0.2/src/timetablemate.cpp:111: error: invalid static_cast from type 'KParts::ReadOnlyPart*' to type 'KWebKitPart*'
/home/thomas/rpmbuild/BUILD/publictransport-0.8.3_timetablemate-0.2.1/timetablemate-0.2/src/timetablemate.cpp:118: error: invalid use of incomplete type 'struct KWebKitPart'
/home/thomas/rpmbuild/BUILD/publictransport-0.8.3_timetablemate-0.2.1/timetablemate-0.2/src/timetablemate.h:38: error: forward declaration of 'struct KWebKitPart'
/home/thomas/rpmbuild/BUILD/publictransport-0.8.3_timetablemate-0.2.1/timetablemate-0.2/src/timetablemate.cpp:119: error: invalid use of incomplete type 'struct KWebKitPart'
/home/thomas/rpmbuild/BUILD/publictransport-0.8.3_timetablemate-0.2.1/timetablemate-0.2/src/timetablemate.h:38: error: forward declaration of 'struct KWebKitPart'
/home/thomas/rpmbuild/BUILD/publictransport-0.8.3_timetablemate-0.2.1/timetablemate-0.2/src/timetablemate.cpp:120: error: invalid use of incomplete type 'struct KWebKitPart'
/home/thomas/rpmbuild/BUILD/publictransport-0.8.3_timetablemate-0.2.1/timetablemate-0.2/src/timetablemate.h:38: error: forward declaration of 'struct KWebKitPart'
/home/thomas/rpmbuild/BUILD/publictransport-0.8.3_timetablemate-0.2.1/timetablemate-0.2/src/timetablemate.cpp:121: error: invalid use of incomplete type 'struct KWebKitPart'
/home/thomas/rpmbuild/BUILD/publictransport-0.8.3_timetablemate-0.2.1/timetablemate-0.2/src/timetablemate.h:38: error: forward declaration of 'struct KWebKitPart'
/home/thomas/rpmbuild/BUILD/publictransport-0.8.3_timetablemate-0.2.1/timetablemate-0.2/src/timetablemate.cpp:122: error: invalid use of incomplete type 'struct KWebKitPart'
/home/thomas/rpmbuild/BUILD/publictransport-0.8.3_timetablemate-0.2.1/timetablemate-0.2/src/timetablemate.h:38: error: forward declaration of 'struct KWebKitPart'
/home/thomas/rpmbuild/BUILD/publictransport-0.8.3_timetablemate-0.2.1/timetablemate-0.2/src/timetablemate.cpp:123: error: invalid use of incomplete type 'struct KWebKitPart'
/home/thomas/rpmbuild/BUILD/publictransport-0.8.3_timetablemate-0.2.1/timetablemate-0.2/src/timetablemate.h:38: error: forward declaration of 'struct KWebKitPart'
/home/thomas/rpmbuild/BUILD/publictransport-0.8.3_timetablemate-0.2.1/timetablemate-0.2/src/timetablemate.cpp:132: error: invalid use of incomplete type 'struct KWebKitPart'
/home/thomas/rpmbuild/BUILD/publictransport-0.8.3_timetablemate-0.2.1/timetablemate-0.2/src/timetablemate.h:38: error: forward declaration of 'struct KWebKitPart'
/home/thomas/rpmbuild/BUILD/publictransport-0.8.3_timetablemate-0.2.1/timetablemate-0.2/src/timetablemate.cpp:137: error: invalid use of incomplete type 'struct KWebKitPart'
/home/thomas/rpmbuild/BUILD/publictransport-0.8.3_timetablemate-0.2.1/timetablemate-0.2/src/timetablemate.h:38: error: forward declaration of 'struct KWebKitPart'
/home/thomas/rpmbuild/BUILD/publictransport-0.8.3_timetablemate-0.2.1/timetablemate-0.2/src/timetablemate.cpp:141: error: no matching function for call to 'TimetableMate::connect(KWebKitPart*&, const char [27], TimetableMate* const, const char [31])'
/usr/include/QtCore/qobject.h:198: note: candidates are: static bool QObject::connect(const QObject*, const char*, const QObject*, const char*, Qt::ConnectionType)
/usr/include/QtCore/qobject.h:313: note: bool QObject::connect(const QObject*, const char*, const char*, Qt::ConnectionType) const
/home/thomas/rpmbuild/BUILD/publictransport-0.8.3_timetablemate-0.2.1/timetablemate-0.2/src/timetablemate.cpp:142: error: invalid use of incomplete type 'struct KWebKitPart'
/home/thomas/rpmbuild/BUILD/publictransport-0.8.3_timetablemate-0.2.1/timetablemate-0.2/src/timetablemate.h:38: error: forward declaration of 'struct KWebKitPart'
/home/thomas/rpmbuild/BUILD/publictransport-0.8.3_timetablemate-0.2.1/timetablemate-0.2/src/timetablemate.cpp:260: error: no matching function for call to 'KParts::PartManager::addPart(KWebKitPart*&, bool)'
/usr/include/kde4/KDE/KParts/../../kparts/partmanager.h:148: note: candidates are: virtual void KParts::PartManager::addPart(KParts::Part*, bool)
/home/thomas/rpmbuild/BUILD/publictransport-0.8.3_timetablemate-0.2.1/timetablemate-0.2/src/timetablemate.cpp: In member function 'void TimetableMate::showWebTab(const QString&, RawUrl)':
/home/thomas/rpmbuild/BUILD/publictransport-0.8.3_timetablemate-0.2.1/timetablemate-0.2/src/timetablemate.cpp:606: error: invalid use of incomplete type 'struct KWebKitPart'
/home/thomas/rpmbuild/BUILD/publictransport-0.8.3_timetablemate-0.2.1/timetablemate-0.2/src/timetablemate.h:38: error: forward declaration of 'struct KWebKitPart'
/home/thomas/rpmbuild/BUILD/publictransport-0.8.3_timetablemate-0.2.1/timetablemate-0.2/src/timetablemate.cpp: In member function 'void TimetableMate::currentTabChanged(int)':
/home/thomas/rpmbuild/BUILD/publictransport-0.8.3_timetablemate-0.2.1/timetablemate-0.2/src/timetablemate.cpp:644: error: no matching function for call to 'KParts::PartManager::setActivePart(KWebKitPart*&, KTabWidget*&)'
/usr/include/kde4/KDE/KParts/../../kparts/partmanager.h:172: note: candidates are: virtual void KParts::PartManager::setActivePart(KParts::Part*, QWidget*)
/home/thomas/rpmbuild/BUILD/publictransport-0.8.3_timetablemate-0.2.1/timetablemate-0.2/src/timetablemate.cpp: In member function 'void TimetableMate::setupActions()':
/home/thomas/rpmbuild/BUILD/publictransport-0.8.3_timetablemate-0.2.1/timetablemate-0.2/src/timetablemate.cpp:712: error: invalid use of incomplete type 'struct KWebKitPart'
/home/thomas/rpmbuild/BUILD/publictransport-0.8.3_timetablemate-0.2.1/timetablemate-0.2/src/timetablemate.h:38: error: forward declaration of 'struct KWebKitPart'
/home/thomas/rpmbuild/BUILD/publictransport-0.8.3_timetablemate-0.2.1/timetablemate-0.2/src/timetablemate.cpp:716: error: invalid use of incomplete type 'struct KWebKitPart'
/home/thomas/rpmbuild/BUILD/publictransport-0.8.3_timetablemate-0.2.1/timetablemate-0.2/src/timetablemate.h:38: error: forward declaration of 'struct KWebKitPart'
/home/thomas/rpmbuild/BUILD/publictransport-0.8.3_timetablemate-0.2.1/timetablemate-0.2/src/timetablemate.cpp:720: error: invalid use of incomplete type 'struct KWebKitPart'
/home/thomas/rpmbuild/BUILD/publictransport-0.8.3_timetablemate-0.2.1/timetablemate-0.2/src/timetablemate.h:38: error: forward declaration of 'struct KWebKitPart'
/home/thomas/rpmbuild/BUILD/publictransport-0.8.3_timetablemate-0.2.1/timetablemate-0.2/src/timetablemate.cpp:724: error: invalid use of incomplete type 'struct KWebKitPart'
/home/thomas/rpmbuild/BUILD/publictransport-0.8.3_timetablemate-0.2.1/timetablemate-0.2/src/timetablemate.h:38: error: forward declaration of 'struct KWebKitPart'
/home/thomas/rpmbuild/BUILD/publictransport-0.8.3_timetablemate-0.2.1/timetablemate-0.2/src/timetablemate.cpp: In member function 'void TimetableMate::urlBarReturn(const QString&)':
/home/thomas/rpmbuild/BUILD/publictransport-0.8.3_timetablemate-0.2.1/timetablemate-0.2/src/timetablemate.cpp:1472: error: invalid use of incomplete type 'struct KWebKitPart'
/home/thomas/rpmbuild/BUILD/publictransport-0.8.3_timetablemate-0.2.1/timetablemate-0.2/src/timetablemate.h:38: error: forward declaration of 'struct KWebKitPart'
/home/thomas/rpmbuild/BUILD/publictransport-0.8.3_timetablemate-0.2.1/timetablemate-0.2/src/timetablemate.cpp: In member function 'void TimetableMate::webLoadHomePage()':
/home/thomas/rpmbuild/BUILD/publictransport-0.8.3_timetablemate-0.2.1/timetablemate-0.2/src/timetablemate.cpp:1487: error: invalid use of incomplete type 'struct KWebKitPart'
/home/thomas/rpmbuild/BUILD/publictransport-0.8.3_timetablemate-0.2.1/timetablemate-0.2/src/timetablemate.h:38: error: forward declaration of 'struct KWebKitPart'
/home/thomas/rpmbuild/BUILD/publictransport-0.8.3_timetablemate-0.2.1/timetablemate-0.2/src/timetablemate.cpp: In member function 'void TimetableMate::webLoadDepartures()':
/home/thomas/rpmbuild/BUILD/publictransport-0.8.3_timetablemate-0.2.1/timetablemate-0.2/src/timetablemate.cpp:1500: error: invalid use of incomplete type 'struct KWebKitPart'
/home/thomas/rpmbuild/BUILD/publictransport-0.8.3_timetablemate-0.2.1/timetablemate-0.2/src/timetablemate.h:38: error: forward declaration of 'struct KWebKitPart'
/home/thomas/rpmbuild/BUILD/publictransport-0.8.3_timetablemate-0.2.1/timetablemate-0.2/src/timetablemate.cpp: In member function 'void TimetableMate::webLoadStopSuggestions()':
/home/thomas/rpmbuild/BUILD/publictransport-0.8.3_timetablemate-0.2.1/timetablemate-0.2/src/timetablemate.cpp:1513: error: invalid use of incomplete type 'struct KWebKitPart'
/home/thomas/rpmbuild/BUILD/publictransport-0.8.3_timetablemate-0.2.1/timetablemate-0.2/src/timetablemate.h:38: error: forward declaration of 'struct KWebKitPart'
/home/thomas/rpmbuild/BUILD/publictransport-0.8.3_timetablemate-0.2.1/timetablemate-0.2/src/timetablemate.cpp: In member function 'void TimetableMate::webLoadJourneys()':
/home/thomas/rpmbuild/BUILD/publictransport-0.8.3_timetablemate-0.2.1/timetablemate-0.2/src/timetablemate.cpp:1526: error: invalid use of incomplete type 'struct KWebKitPart'
/home/thomas/rpmbuild/BUILD/publictransport-0.8.3_timetablemate-0.2.1/timetablemate-0.2/src/timetablemate.h:38: error: forward declaration of 'struct KWebKitPart'
make[2]: *** [src/CMakeFiles/timetablemate.dir/timetablemate.o] Error 1
make[2]: *** Waiting for unfinished jobs....
make[2]: Leaving directory `/home/thomas/rpmbuild/BUILD/publictransport-0.8.3_timetablemate-0.2.1/timetablemate-0.2/x86_64-redhat-linux-gnu'
make[1]: *** [src/CMakeFiles/timetablemate.dir/all] Error 2
make[1]: Leaving directory `/home/thomas/rpmbuild/BUILD/publictransport-0.8.3_timetablemate-0.2.1/timetablemate-0.2/x86_64-redhat-linux-gnu'
make: *** [all] Error 2
make: Leaving directory `/home/thomas/rpmbuild/BUILD/publictransport-0.8.3_timetablemate-0.2.1/timetablemate-0.2/x86_64-redhat-linux-gnu'
error: Bad exit status from /var/tmp/rpm-tmp.WibTsn (%build)

Sorry, that's a long one. Is there a bugtracker for publictransport somewhere? - May 24 2010
Indeed. I'm the Fedora packager and i copy that. It's right now a mess.

Another issue i would love to see fixed is the License. The included file is a GPL file, but the source files state it's LGPL. - May 24 2010
Bangarang

Audioplayers 123 comments

Score 87%
87 Likes
13 Dislikes
Dec 07 2011
Yeah, i was swamped lately with work. But i'm currently updating to 1.0.1.

Builds for rawhide, F-13 are done, F-12 running currently. Will be in updates-testing with the next push. Most likely Monday :) - May 01 2010
Why not use: yum install bangarang

I'm the bangarang maintainer in Fedora. - May 01 2010
KAudioCreator

Utilities 43 comments

Score 75%
75 Likes
25 Dislikes
Sep 03 2011
Hi, when i compile kaudiocreator i get rpmlint errors like:
kaudiocreator-debuginfo.x86_64: E: world-writable /usr/src/debug/kaudiocreator-1.2.81/x86_64-redhat-linux-gnu/ui_encodefile.h 0666

You know by chance how to solve that? Or explain the reason why those files are world writable?

Thanks by the way for the KDE4 port! - Apr 18 2010
luckyBackup

System Software 235 comments

Score 93%
93 Likes
7 Dislikes
Mar 28 2014
Ok, everything is sorted out. The default behavior of luckybackup to run as regular user and root is now in Fedora repos as well.
I built and queued release -3 to updates-testing today. It's waiting for the next push to the repo which will probably be tomorrow (Monday).

You can update with:
yum --enablerepo=updates-testing update luckybackup

Have fun and happy backup ;)

Thanks to Loukas :) - Mar 07 2010
Hi, sorry, i'm the maintainer in Fedora.
https://admin.fedoraproject.org/pkgdb/packages/name/luckybackup

Ok, trying to revert from consolekit to default behavior. I added beesu to Requires in my spec. It got installed fine, though if i execute luckybackup (super user mode) in GNOME, i get a "Failed to execute the child process "su-to-root" (no such file or directory"

Works fine in KDE SC 4.4.0

Do i miss something, maybe not mentioned at: http://luckybackup.sourceforge.net/install.html - Mar 06 2010
Pixelate

Yakuake Skins

Score 68%
68 Likes
32 Dislikes
Apr 10 2011
DIfmoid (DI.fm plasmoid)

Plasma 4 Widgets

Score 61%
61 Likes
39 Dislikes
Feb 15 2011
KMobileTools

Groupware

Score 83%
83 Likes
17 Dislikes
Sep 02 2010
Blokkal

Web & Browser

Score 77%
77 Likes
23 Dislikes
Jun 16 2010
PublicTransport

Plasma 4 Widgets

Score 92%
92 Likes
8 Dislikes
May 24 2010
KParts Plugin

Web & Browser

Score 87%
87 Likes
13 Dislikes
May 21 2010
QMediaBibliothek

Video Apps

Score 59%
59 Likes
41 Dislikes
May 19 2010
KFTPgrabber

Network

Score 82%
82 Likes
18 Dislikes
May 18 2010
skrooge

Financial

Score 88%
88 Likes
12 Dislikes
May 18 2010
Events Plasma Runner

Krunner Plugins

Score 73%
73 Likes
27 Dislikes
May 18 2010
KDE Partition Manager

System Software

Score 93%
93 Likes
7 Dislikes
May 18 2010
Bangarang

Audioplayers

Score 87%
87 Likes
13 Dislikes
May 18 2010
Score 78%
78 Likes
22 Dislikes
May 17 2010
Smooth Tasks

Plasma 4 Widgets

Score 93%
93 Likes
7 Dislikes
May 17 2010
luckyBackup

System Software

Score 93%
93 Likes
7 Dislikes
May 17 2010
OpenSUSE Green

Wallpaper Other

Score 54%
54 Likes
46 Dislikes
May 13 2011